program: Gaussian 16
title: Title Card Required
version: ES64L-G16RevC.01
frameworkgroup: C1[X(C14H25Cl2N3Pd)]
method: RMN15
basis: def2QZVPP
operation: Freq
keyword: #N
keyword: Geom=AllCheck
keyword: Guess=TCheck
keyword: SCRF=Check
keyword: GenChk
keyword: RMN15/def2QZVPP
keyword: Freq
converged: YES YES NO YES
title: Mulliken charges:
elementType: C C C C C C H H H H H H H H C H C H Pd Cl Cl C N N C H H H C H H H N C H H H C H H H C H H H
charge: -0.535606 -0.317546 0.129985 -0.369579 -0.266056 -0.209991 0.206095 0.131031 0.296829 0.166253 0.195281 0.147067 0.140660 0.190775 -0.116325 0.156788 -0.254606 0.166643 0.845557 -0.489769 -0.507100 0.153484 -0.513273 -0.115527 -0.207859 0.108695 0.109231 0.105000 -0.234641 0.109770 0.155185 0.067686 -0.033293 -0.206900 0.105894 0.155282 0.123923 -0.132943 0.143481 0.099170 0.105224 -0.286480 0.155143 0.161599 0.165763
chargesum: -0.00000
title: Mulliken charges with hydrogens summed into heavy atoms:
elementType: C C C C C C C C Pd Cl Cl C N N C C N C C C
charge: -0.134230 -0.186514 0.129985 -0.072750 0.047263 0.121444 0.040462 -0.087963 0.845557 -0.489769 -0.507100 0.153484 -0.513273 -0.115527 0.115067 0.098000 -0.033293 0.178200 0.214932 0.196024
chargesum: 0.00000
1716.lowfreq: -0.0020 -0.0011 0.0017 1.4558 4.4575 4.7755 23.1196 24.1756 27.6740
frequency: 23.0931 24.1715 27.6659 35.2103 45.6536 56.9721 70.1824 78.3567 84.9621 99.9775 110.9363 111.9819 122.1153 128.3549 138.1644 152.8082 157.8300 163.2976 191.5961 203.0686 209.9582 218.8320 225.5155 233.9923 257.1605 262.4535 273.7644 283.9170 293.2966 319.7172 350.5738 351.0488 392.4811 409.4271 416.6357 433.1418 436.9069 450.1722 481.8327 507.2987 548.8211 578.4068 597.8560 640.0984 668.1646 754.0211 845.6241 852.4264 870.5627 926.6418 930.5276 949.8927 961.9307 968.7899 1011.4840 1015.7950 1031.3568 1037.9285 1044.1442 1044.6475 1061.8072 1077.9781 1080.6373 1100.2300 1109.5938 1111.7786 1131.9911 1147.8892 1156.4839 1163.3639 1206.6911 1216.3757 1252.4554 1284.4089 1290.7816 1323.5705 1331.1547 1342.6789 1383.2864 1390.7217 1396.7939 1427.0002 1431.4701 1434.7042 1437.7946 1444.1075 1449.5024 1454.8622 1455.2178 1456.1343 1461.0852 1462.5759 1468.3819 1476.8295 1479.0210 1483.3991 1490.1087 1499.7693 1501.8997 1520.4156 1647.1776 1658.6534 1682.5689 2441.6359 3004.1703 3025.1991 3056.0225 3062.3267 3066.0098 3082.5111 3092.8802 3093.1243 3095.3382 3123.0854 3138.2863 3138.5097 3141.3786 3142.4344 3153.0567 3160.2912 3163.9791 3173.8649 3174.8077 3178.2779 3179.4687 3183.9174 3198.0339 3231.7064 3258.3145
redmass: 1.0799 2.7396 4.2658 3.4658 5.0998 2.8249 3.0581 3.3597 2.5666 5.4567 4.4149 4.4149 1.9350 1.9452 1.6184 2.9060 2.7345 12.5123 5.5120 3.2581 3.5858 2.4658 2.3085 1.8139 1.6894 3.9391 5.1016 2.7052 17.4099 4.3219 15.5828 2.2419 2.6517 2.5033 3.7082 4.2688 2.5667 2.8902 2.9310 3.0168 3.3289 3.3086 2.2887 2.5627 1.6413 2.6546 1.4291 2.3348 2.5541 1.8849 1.6358 2.5028 1.4383 4.2420 1.2648 2.1142 1.6640 1.1525 1.4593 1.4612 1.7003 1.3570 1.4077 1.5421 1.2401 1.3588 1.6187 1.4273 1.4254 1.6135 1.4114 1.5379 1.8194 2.2167 2.2548 1.3520 1.4050 1.4049 1.4666 1.6502 1.2624 1.5756 1.2849 1.4037 1.3859 1.3189 1.2077 1.0370 1.0373 1.0863 1.1162 1.0728 1.1563 1.1261 1.0494 1.0933 1.0553 1.0850 1.2137 1.4215 5.9005 4.5147 4.4040 12.6282 1.0496 1.0497 1.0357 1.0339 1.0717 1.0855 1.0655 1.0341 1.0922 1.1032 1.0966 1.0999 1.0850 1.1032 1.0936 1.0998 1.0892 1.0652 1.1005 1.1026 1.1029 1.0856 1.0933 1.0895 1.1150
irintensity: 0.1954 1.0362 3.3945 4.1197 5.2664 2.1885 4.6836 1.6217 1.1482 0.4500 1.5084 5.2971 4.4892 0.0689 3.3579 4.8872 1.3863 2.3315 3.4092 3.6064 2.1719 7.0503 3.2120 3.1927 3.3596 3.8907 2.2252 0.7099 6.9729 5.1997 43.5509 1.7167 0.7102 1.2366 0.2404 0.1236 0.1902 2.0085 21.6104 6.0935 16.4612 54.8495 8.0713 12.5811 18.4109 0.7954 25.6675 5.4429 2.7501 16.9627 31.4689 10.6775 44.1136 0.9161 4.2378 10.1851 11.6006 21.0637 2.4715 2.6168 39.2991 4.4601 8.1513 2.2852 0.5514 4.2531 51.0754 22.1653 3.2522 19.5370 1.1420 5.2376 27.0357 23.6051 3.8626 11.8756 10.9655 3.9405 4.0296 33.7002 0.1279 37.3083 1.6104 21.7158 24.3393 8.4716 14.6918 10.7293 10.6710 2.3511 19.3016 3.6797 3.6891 11.7221 2.2122 4.3470 8.6104 7.7207 19.7117 72.0695 268.9306 487.8350 20.7497 15.3333 71.6027 120.8521 30.4581 61.1648 32.6533 35.0650 28.8286 0.6826 11.2661 15.8005 3.3213 21.8746 24.8755 9.1805 4.0914 7.9626 7.1461 8.3275 9.9190 0.0015 0.0380 12.4602 8.9263 0.6905 20.6442
temp: 298.150 k
press: 1.00000 atm
elementType: 6 6 6 6 6 6 1 1 1 1 1 1 1 1 6 1 6 1 46 17 17 6 7 7 6 1 1 1 6 1 1 1 7 6 1 1 1 6 1 1 1 6 1 1 1
symmnumber: 1
zpe: 988448.1 jmol-1
zpe.correction: 0.376480 hartree
zpe.thermalcorrener: 0.403710 hartree
zpe.thermalcorrenthalpy: 0.404654 hartree
zpe.thermalcorrgfe: 0.316124 hartree
zpe.sumelectzpe: -1760.320561 hartree
zpe.sumelectthermal: -1760.293331 hartree
zpe.sumelectthermalent: -1760.292387 hartree
zpe.sumelectthermalfe: -1760.380917 hartree
dipole: -1.3331 1.3535 3.6893
dipole: 4.1497
quadrupole: -114.4445 -152.6125 -147.0671
quadrupole: -10.1837 -4.8638 -11.0819
quadrupole: 23.5969 -14.5711 -9.0257 -10.1837 -4.8638 -11.0819
hfenergy: -1760.697041 hartree
pointgroup: C01 [X(C14H25Cl2N3Pd1)]
dipole: -0.5244956 0.5325176 1.4514783 debye
polarizability: 317.7414843|-17.4212576|290.4524875|11.0798048|6.128179|215.2124706 unknown
InChI: InChI=1S/C12H22N2.C2H3N.2ClH.Pd/c1-6-9-12(14(4)5)10-7-8-11-13(2)3;1-2-3;;;/h6,8-9,11H,1,7,10H2,2-5H3;1H3;2*1H;/q;;;;+2/p-2
charge 0 multiplicity 1
45 atoms
C  3.55359522 -2.42839521 -0.63004356
C  0.79265712 -0.60886376 0.53966269
C  3.11914284 0.78612019 -0.52226061
C  0.37123234 -0.61393705 -0.81576069
C  2.48310465 0.41880503 -1.83497712
C  0.94529686 0.44371195 -1.74310834
H  2.54986408 -2.28404295 -1.00655552
H  1.09725263 0.33770012 0.96774068
H  0.28484094 -1.59771205 -1.2685348
H  2.84788845 -0.55495014 -2.14921024
H  3.97848034 -3.41662812 -0.74044445
H  2.80149982 1.12471576 -2.60575724
H  0.51835851 0.29368363 -2.73444948
H  0.6269386 1.42836314 -1.40413543
C  4.25878282 -1.44782572 -0.05463693
H  5.23780304 -1.72349603 0.32920348
C  3.9119819 -0.05596178 0.19714878
H  4.41752146 0.36814624 1.05678001
Pd -1.55104182 -0.05666171 -0.23367311
Cl -2.31117332 -1.99910418 -1.18658919
Cl -0.86735436 1.96280231 0.70478883
C  -4.5821993 0.74550045 0.38889264
N  -3.49185694 0.46068497 0.2002606
N  2.77297322 2.01958092 -0.0202768
C  2.40166297 3.15776033 -0.83433612
H  1.48238364 3.60173476 -0.44711351
H  3.19241313 3.91490207 -0.82517762
H  2.22975339 2.87046522 -1.86507753
C  3.07418591 2.35818153 1.3455032
H  4.12814052 2.61937781 1.50177004
H  2.45698905 3.20761952 1.63468997
H  2.83650036 1.51915959 2.00310205
N  0.85349423 -1.64079312 1.35635611
C  1.4094949 -1.49427899 2.68517526
H  0.70161344 -1.85047496 3.43364244
H  2.33160261 -2.07390167 2.76216633
H  1.63324554 -0.44751162 2.87284576
C  0.41931727 -2.97433291 0.97638383
H  1.24213574 -3.54281633 0.54209096
H  0.07282356 -3.48764717 1.87136125
H  -0.40806569 -2.90989574 0.27117092
C  -5.96805075 1.10572823 0.62376552
H  -6.22777638 0.91400512 1.66195222
H  -6.11490754 2.16145584 0.40971716
H  -6.614697 0.51530951 -0.02062043
