program: Gaussian 16
title: Title Card Required
version: ES64L-G16RevC.01
frameworkgroup: C1[X(C12H19Cl2NPdS2)]
method: RMN15
basis: def2SVP
operation: Freq
keyword: #N
keyword: Geom=AllCheck
keyword: Guess=TCheck
keyword: SCRF=Check
keyword: GenChk
keyword: RMN15/def2SVPFreq
converged: YES YES NO NO
title: Mulliken charges:
elementType: C C C C C C H H H H H H H C H C H Pd Cl Cl C N C H H H H S S C H H H C H H H
charge: -0.233458 0.101878 -0.163346 -0.148099 0.089436 0.120017 0.054457 0.061277 0.032611 0.027040 0.013221 0.039471 0.008124 0.108293 0.036104 0.035589 -0.014896 -0.116749 -0.328134 -0.345465 -0.280712 0.204155 0.086255 0.080522 0.077500 0.078066 0.087748 0.069718 -0.014910 -0.114956 0.084872 0.094810 0.080583 -0.085191 0.046281 0.068458 0.059431
chargesum: 0.00000
title: Mulliken charges with hydrogens summed into heavy atoms:
elementType: C C C C C C C C Pd Cl Cl C N C S S C C
charge: -0.179000 0.250904 -0.163346 -0.115488 0.129696 0.167612 0.144397 0.020693 -0.116749 -0.328134 -0.345465 -0.280712 0.204155 0.322343 0.069718 -0.014910 0.145309 0.088978
chargesum: -0.00000
1716.lowfreq: -502.4382 -5.5280 -2.2551 -0.0011 0.0015 0.0023 3.1055 15.3378 18.6743
frequency: -502.4382 15.3077 18.6661 23.2785 28.0453 33.3898 44.9237 67.7736 91.7453 98.5727 104.7267 117.8941 126.9881 152.8913 157.6462 162.5851 173.6795 183.7337 201.7619 214.6600 231.6887 242.3515 246.7348 252.2274 263.2132 302.8500 318.4788 334.2344 347.1605 359.8455 392.5250 399.6687 417.1170 429.3768 444.2216 590.7159 613.2926 665.0268 730.2572 746.3545 763.7682 788.6596 824.1267 831.0258 865.7604 933.8246 945.9149 948.9451 954.6323 961.4102 963.9088 979.1737 981.6233 1002.0052 1021.7166 1025.3892 1025.6544 1050.0535 1082.7283 1117.8778 1121.2554 1156.8057 1194.2688 1206.0934 1225.9304 1247.9139 1279.0131 1306.3764 1316.3674 1322.3795 1326.8975 1370.7131 1371.2291 1377.8590 1420.1593 1420.7372 1420.8705 1422.7429 1428.0058 1431.7709 1436.0987 1438.0076 1448.6946 1566.6624 1588.2330 2465.0694 3073.6515 3076.5239 3086.2004 3094.4457 3099.7041 3123.5781 3127.2248 3129.8375 3157.0545 3180.1909 3181.7372 3199.5665 3201.9413 3206.3485 3208.5324 3209.6870 3214.6492 3238.2175 3240.8697
redmass: 10.3662 1.0706 3.8580 8.5413 4.7207 4.8897 3.7106 5.6627 5.7773 11.3791 4.7990 4.9754 4.8107 2.9232 3.2032 11.2594 1.3574 3.6740 6.0336 4.6890 3.9167 1.3021 5.0169 6.2802 2.8725 20.5403 4.4706 3.2053 3.2209 7.5124 3.5066 2.7061 2.3669 3.8972 4.6873 6.6841 3.6345 3.0890 3.5134 5.0979 3.8768 2.0089 1.6868 1.3631 2.9869 1.6279 1.3488 1.3943 1.2056 1.3849 1.3414 2.3352 1.9382 1.4395 1.8832 1.4773 1.4745 1.7830 1.5393 2.1137 1.2736 1.2250 1.4608 1.5827 1.3896 1.2561 1.2564 1.3761 1.2854 1.1746 1.2492 1.3579 1.5011 1.2696 1.0362 1.0365 1.0491 1.0467 1.1927 1.0742 1.0793 1.3635 1.2358 4.5342 5.4922 12.6186 1.0322 1.0625 1.0319 1.0636 1.0355 1.0613 1.0863 1.1021 1.1046 1.0979 1.0994 1.1049 1.1092 1.0887 1.1050 1.1053 1.1056 1.1132 1.0886
irintensity: 2142.0856 0.3731 1.7424 1.6900 7.4340 5.7468 0.0731 0.5117 0.5476 2.2471 3.9111 4.5270 4.1706 3.6131 10.0258 5.1764 0.5081 15.1482 0.3074 2.6528 0.3878 0.7882 7.0754 1.1342 4.5742 3.3452 3.3167 2.7598 19.6249 24.7105 8.1210 14.6704 16.7530 2.6824 1.0447 32.5030 13.7118 17.8046 23.3079 6.1035 0.9779 41.7242 8.7728 23.3238 4.0860 22.3611 4.5369 23.0425 2.6574 18.9096 23.4266 75.8242 103.1287 48.3943 15.4484 6.0135 5.0301 12.8773 6.2321 29.8893 16.6822 101.9283 6.6456 3.8246 68.9608 3.6035 17.9650 4.6094 13.5733 1.4138 1.1080 4.1041 4.8286 3.8483 11.8489 12.5014 15.3748 19.1758 5.6323 48.9561 19.8083 7.9392 23.6880 286.7051 904.1055 8.4376 21.9550 18.0164 8.8693 6.9446 0.7264 17.3381 4.8546 10.3259 4.1836 4.8264 7.4208 3.2896 1.3762 8.0991 0.4230 0.5826 0.1601 13.3725 6.0031
temp: 298.150 k
press: 1.00000 atm
elementType: 6 6 6 6 6 6 1 1 1 1 1 1 1 6 1 6 1 46 17 17 6 7 6 1 1 1 1 16 16 6 1 1 1 6 1 1 1
symmnumber: 1
zpe: 752295.1 jmol-1
zpe.correction: 0.286534 hartree
zpe.thermalcorrener: 0.310902 hartree
zpe.thermalcorrenthalpy: 0.311847 hartree
zpe.thermalcorrgfe: 0.227205 hartree
zpe.sumelectzpe: -2365.383806 hartree
zpe.sumelectthermal: -2365.359438 hartree
zpe.sumelectthermalent: -2365.358494 hartree
zpe.sumelectthermalfe: -2365.443136 hartree
dipole: 6.5187 -1.9694 -2.3567
dipole: 7.2059
quadrupole: -79.1488 -148.1598 -155.5284
quadrupole: 5.9542 8.1774 -4.9589
quadrupole: 48.4636 -20.5475 -27.9161 5.9542 8.1774 -4.9589
hfenergy: -2365.6703403 hartree
pointgroup: C01 [X(C12H19Cl2N1Pd1S2)]
dipole: 2.5645754 -0.7759725 -0.9264161 debye
polarizability: 406.1538987|-31.4716597|259.5013394|-7.7938226|0.8261409|177.0471436 unknown
InChI: InChI=1S/C10H16S2.C2H3N.2ClH.Pd/c1-11-9-5-3-4-6-10(12-2)8-7-9;1-2-3;;;/h3,7-9H,4-6H2,1-2H3;1H3;2*1H;/q;;;;+2/p-2
charge 0 multiplicity 1
37 atoms
C  1.98510417 1.78338776 -0.16542091
C  0.32766463 0.93607037 -0.40669765
C  3.16734728 -1.12987438 0.44851932
C  -0.01081231 0.19918364 0.8051043
C  2.20208057 -0.8868774 1.58709677
C  0.73101147 -1.08088209 1.16243152
H  2.03765618 1.72599138 0.92504211
H  0.42932725 0.33025588 -1.31442229
H  -0.12144924 0.86525909 1.67393214
H  2.37112914 0.11662194 2.0140555
H  2.45495867 -1.59617157 2.39086902
H  0.19254068 -1.54645782 2.00120099
H  0.67298845 -1.79069339 0.32207714
C  2.79004699 0.93253257 -0.94234185
H  2.94220159 1.28586502 -1.97105939
C  3.35014436 -0.33751032 -0.66813147
H  3.96575129 -0.73659668 -1.47586019
Pd -1.93533719 -0.14902119 0.18538029
Cl -2.60900994 1.48401874 1.67527807
Cl -1.20223238 -1.72689277 -1.38147761
C  -5.01316664 -0.72919856 -0.64297696
N  -3.91475348 -0.51732479 -0.3628616
C  -6.40001744 -0.99292087 -0.99360746
H  -7.06496394 -0.58403737 -0.22140862
H  -6.63798952 -0.52182041 -1.95651333
H  -6.56638547 -2.07515144 -1.07564504
H  -0.24298354 1.86305783 -0.56160451
S  3.95385438 -2.63543807 0.66029034
S  1.74446908 3.43879031 -0.79154212
C  5.01752718 -2.83725165 -0.76778154
H  5.5528225 -3.78295903 -0.61553195
H  4.42718284 -2.90567663 -1.69204878
H  5.74553623 -2.01756096 -0.83920506
C  3.33566783 4.16912425 -0.36232339
H  4.1642808 3.66506172 -0.88100196
H  3.30491436 5.21943562 -0.68243865
H  3.50667115 4.14003523 0.72321789
