program: Gaussian 16
title: min nm2166_B irc ( for irc NM1549 (sub 2.17 from nm1243 for ts (from s can nm1140 freeze 1 2 at 2.2 and scan 5 6 (took nm1128.com andchanged both to p(ch3)2))))
version: ES64L-G16RevC.01
method: RMN15
basis: def2SVP
operation: Freq
keyword: #N
keyword: Geom=AllCheck
keyword: Guess=TCheck
keyword: SCRF=Check
keyword: GenChk
keyword: RMN15/def2SVPFreq
keyword: RMN15/def2SVP
keyword: Freq
title: min nm2166_B irc ( for irc NM1549 (sub 2.17 from nm1243 for ts (from s
converged: YES YES YES YES
title: Mulliken charges:
elementType: C C C C C C H H H H H H H C H C H Pd Cl Cl C N C H H H H S S C H H H C H H H
charge: -0.196818 0.197939 -0.181367 -0.143166 0.084043 0.049339 0.044361 0.004327 0.038677 0.040909 0.043224 0.080166 0.029755 0.043107 0.029849 0.069369 0.003043 -0.105165 -0.313180 -0.342599 -0.278790 0.200839 0.085867 0.080020 0.079463 0.080952 0.042949 0.065730 -0.038203 -0.094722 0.041186 0.066518 0.057199 -0.107814 0.083185 0.087350 0.072457
chargesum: -0.00000
title: Mulliken charges with hydrogens summed into heavy atoms:
elementType: C C C C C C C C Pd Cl Cl C N C S S C C
charge: -0.152457 0.245215 -0.181367 -0.104489 0.168176 0.159260 0.072957 0.072411 -0.105165 -0.313180 -0.342599 -0.278790 0.200839 0.326303 0.065730 -0.038203 0.070180 0.135178
1716.lowfreq: -462.0924 -5.0023 -2.1875 -0.4056 -0.0014 -0.0011 0.0017 11.6388 17.3925
frequency: -462.0924 11.6211 17.3419 25.7386 28.2236 39.5502 53.3876 66.2585 89.3913 97.0564 102.2303 115.4674 127.6027 147.2705 159.3254 168.7929 174.7462 190.1200 201.8521 220.9254 227.5501 230.6296 250.2366 261.6806 278.4820 293.1319 298.7943 330.9361 359.0894 361.7428 396.1629 407.6534 426.7552 437.9491 450.5214 565.3178 629.4350 647.2112 725.4861 751.8698 760.4134 781.6349 812.8361 830.5428 837.5173 911.3464 921.4410 949.2262 956.6743 963.1397 966.4997 974.5095 979.9821 988.4681 1012.9419 1021.6643 1024.8498 1025.9101 1066.1893 1085.2033 1122.5390 1175.0552 1181.3779 1206.9208 1217.6264 1233.7817 1248.9131 1272.2392 1313.4180 1326.7526 1332.0517 1358.1917 1370.7699 1399.5824 1412.7815 1419.8510 1420.1113 1421.7709 1425.9388 1426.2213 1432.2665 1436.8818 1455.0271 1528.1035 1694.1923 2464.7919 3050.9647 3065.1419 3079.8291 3090.6506 3100.0073 3137.4248 3138.2377 3161.7981 3162.5428 3163.9706 3185.4408 3199.3080 3205.6749 3209.0151 3210.3812 3214.4687 3218.5042 3243.5884 3267.9273
redmass: 10.3465 1.0148 4.9337 4.6068 4.5034 7.6806 7.6923 4.3199 3.8310 4.8564 7.1669 5.5680 4.5710 4.4888 9.8484 1.4979 2.8141 1.8173 5.7009 2.9198 3.9169 1.9724 7.1731 5.7855 5.6536 12.4764 2.8946 4.6507 7.9457 3.6897 2.7385 2.5166 4.2305 3.4669 3.4947 6.1794 4.2653 4.0450 4.1808 4.5467 2.5318 2.1122 1.4528 2.0670 1.7253 1.6974 1.8719 1.3056 1.2068 1.3617 1.3938 1.5782 3.7997 1.3719 1.5236 1.2747 1.4780 1.4755 1.4047 2.3919 1.2972 1.5851 1.2666 1.3966 1.4836 1.4119 1.1181 1.2811 1.3814 1.1989 1.1678 1.3303 1.3113 1.3101 1.6090 1.0362 1.0364 1.0522 1.0478 1.0842 1.0995 1.0562 1.6817 3.0789 8.1662 12.6202 1.0824 1.0343 1.0320 1.0644 1.0355 1.0889 1.0581 1.0961 1.0647 1.1070 1.0877 1.1038 1.1092 1.1050 1.1054 1.1061 1.0924 1.1143 1.1155
irintensity: 1524.2860 0.0269 0.6847 5.5439 6.4185 0.3364 5.0494 1.9010 4.1941 0.5454 0.9663 0.9459 4.0420 1.9236 10.0792 0.9162 0.8010 3.3671 0.5678 3.0577 5.0787 2.6728 12.2468 22.8075 2.1560 2.9424 1.0944 2.7420 26.3943 10.4606 4.9138 2.9872 0.2986 7.6397 7.1599 8.8132 55.9305 15.4481 7.7196 2.3105 5.1670 23.3225 0.9658 38.4109 16.9141 27.9771 19.8519 126.4898 5.5057 21.8543 1.9260 7.2179 0.2871 49.6886 15.8883 18.0253 5.7702 5.0092 5.8959 5.9881 2.6299 112.3832 10.8694 42.8854 17.8699 6.2039 10.4689 10.6307 6.4349 0.4249 0.5316 27.4403 0.2079 4.9620 17.4837 12.4398 12.3054 12.5201 11.2130 9.5973 8.0651 18.5509 27.3236 116.9231 84.1107 12.0072 15.0636 21.9773 13.8091 7.8692 0.3599 6.8303 8.7944 1.6759 2.4964 10.6173 0.0487 3.0753 2.8862 0.6727 0.6717 0.8778 5.7244 2.4345 0.6124
temp: 298.150 k
press: 1.00000 atm
elementType: 6 6 6 6 6 6 1 1 1 1 1 1 1 6 1 6 1 46 17 17 6 7 6 1 1 1 1 16 16 6 1 1 1 6 1 1 1
symmnumber: 1
zpe: 751497.4 jmol-1
zpe.correction: 0.286230 hartree
zpe.thermalcorrener: 0.310594 hartree
zpe.thermalcorrenthalpy: 0.311539 hartree
zpe.thermalcorrgfe: 0.227025 hartree
zpe.sumelectzpe: -2365.386194 hartree
zpe.sumelectthermal: -2365.361830 hartree
zpe.sumelectthermalent: -2365.360886 hartree
zpe.sumelectthermalfe: -2365.445400 hartree
dipole: 2.8605 -4.6999 -0.2499
dipole: 5.5076
quadrupole: -93.0030 -149.9332 -155.2208
quadrupole: 6.1236 13.9096 -3.4716
quadrupole: 39.7160 -17.2142 -22.5018 6.1236 13.9096 -3.4716
hfenergy: -2365.6724247 hartree
pointgroup: C01 [X(C12H19Cl2N1Pd1S2)]
dipole: 1.1254021 -1.8490701 -0.0983323 debye
polarizability: 352.0381088|-27.5697709|255.1464717|3.7459302|-0.8896573|182.6760371 unknown
InChI: InChI=1S/C10H16S2.C2H3N.2ClH.Pd/c1-11-9-5-3-4-6-10(12-2)8-7-9;1-2-3;;;/h3,7-9H,4-6H2,1-2H3;1H3;2*1H;/q;;;;+2/p-2
charge 0 multiplicity 1
37 atoms
C  2.5237021 1.28982254 -0.49107889
C  1.03379865 1.02232336 -0.79744913
C  2.52777514 -1.52438419 1.09038238
C  0.19989098 0.8543491 0.46168158
C  1.9948961 -0.64364 2.04673341
C  0.29784347 -0.32084884 1.31429702
H  2.61817242 1.64667046 0.55136398
H  0.92817557 0.14684332 -1.45462341
H  0.15634845 1.78906009 1.03909541
H  2.46549714 0.33513425 2.16887828
H  1.65780763 -1.11132122 2.97721264
H  -0.2433837 -0.20910394 2.26253526
H  0.13261404 -1.29370445 0.84011026
C  3.36302271 0.05292362 -0.70111841
H  4.0498065 0.11438254 -1.55483848
C  3.32306085 -1.13706866 -0.06309315
H  3.94907017 -1.9329497 -0.47597428
Pd -1.75646875 0.39302245 0.0154656
Cl -2.38200744 2.03006291 1.50803005
Cl -1.07681998 -1.39322636 -1.38465651
C  -4.84521896 -0.15574849 -0.7986829
N  -3.74680837 0.02032769 -0.49467627
C  -6.23164236 -0.37420481 -1.18032139
H  -6.29002807 -1.15213429 -1.95292853
H  -6.81409274 -0.69192614 -0.30539016
H  -6.66062779 0.55662289 -1.57437883
H  0.62962252 1.88701111 -1.34792619
S  2.06921465 -3.17276984 1.2591028
S  3.11991494 2.64114656 -1.54430568
C  4.72033938 2.92077744 -0.77301431
H  5.34664816 2.01489889 -0.7915553
H  5.23352583 3.70434503 -1.3459436
H  4.60772498 3.26236322 0.26692197
C  1.97659064 -3.76653955 -0.44230358
H  1.49992137 -4.75314994 -0.37815614
H  1.32749062 -3.09182561 -1.02020424
H  2.96572413 -3.87835643 -0.90434821
