program: Gaussian 16
title: Title Card Required
version: ES64L-G16RevC.01
frameworkgroup: C1[X(C12H20Cl2N2Pd)]
method: RMN15
basis: def2SVP
operation: Freq
keyword: #N
keyword: Geom=AllCheck
keyword: Guess=TCheck
keyword: SCRF=Check
keyword: GenChk
keyword: RMN15/def2SVP
keyword: Freq
converged: YES YES NO NO
title: Mulliken charges:
elementType: C C C C C C H H H H H H H C H C Pd Cl Cl C N H H C H H H N C H H H C H H H H
charge: 0.121837 0.088457 -0.036862 -0.069076 0.017281 -0.039234 -0.021857 0.030305 0.006475 0.034411 0.042503 -0.002285 0.006525 -0.113642 0.017009 0.021634 -0.121659 -0.289074 -0.319545 -0.272610 0.202413 0.051045 -0.019103 0.086145 0.083217 0.080812 0.082823 -0.214998 0.102161 0.089503 0.062560 0.030464 0.098663 0.036621 0.054957 0.059192 0.012932
chargesum: -0.00000
title: Mulliken charges with hydrogens summed into heavy atoms:
elementType: C C C C C C C C Pd Cl Cl C N C N C C
charge: 0.112912 0.099659 0.014183 -0.062601 0.094196 -0.034993 -0.096633 0.021634 -0.121659 -0.289074 -0.319545 -0.272610 0.202413 0.332997 -0.214998 0.284688 0.249433
1716.lowfreq: -1.4420 -1.0123 -0.0019 0.0014 0.0014 5.4452 18.8428 30.7428 35.1637
frequency: 18.8225 30.7366 35.1622 56.2599 61.5388 69.9807 74.3900 101.1864 104.8711 117.5308 128.3423 136.8966 141.3304 146.4753 170.8853 176.5016 191.7842 201.9000 207.7942 220.3597 244.8291 264.6881 290.1848 298.8460 301.7038 347.5579 364.9929 378.7497 422.1870 425.7799 435.9074 445.7010 467.8742 485.3382 594.5375 654.2002 675.1407 703.9670 743.8927 808.5714 865.5037 885.4434 941.1491 945.5352 972.4488 980.4231 982.7244 1003.8049 1024.1755 1025.6088 1030.6978 1034.3581 1063.1404 1078.4255 1079.4950 1100.2831 1133.4298 1142.6543 1173.0761 1205.7363 1238.9652 1250.4518 1263.6692 1294.4312 1333.2220 1336.3782 1352.2543 1370.4939 1388.5432 1395.0621 1407.7473 1411.3525 1415.8485 1418.9965 1419.3674 1427.9936 1435.5904 1441.2715 1444.5992 1455.0701 1460.6326 1628.0774 1737.5632 1738.9346 2466.8543 3031.1730 3056.6715 3082.8184 3085.1659 3100.3404 3118.3516 3146.0540 3155.6204 3157.2979 3160.3158 3168.9406 3182.0008 3183.6236 3204.4078 3209.8055 3211.2892 3213.7906 3233.0842 3266.2442 3290.8726
redmass: 1.0181 4.2299 4.0003 7.1099 2.7650 2.5481 3.5497 4.1319 5.7066 2.8322 2.8740 8.6288 2.2059 3.3318 7.9071 1.7168 2.6991 3.4922 2.6859 5.0350 2.7884 7.1684 2.6306 2.3170 11.9224 1.8628 14.3925 2.9890 3.4098 3.2556 2.5638 4.8192 2.3858 2.3546 2.3554 2.5821 1.5308 2.7090 2.5023 1.8223 1.8718 1.3849 1.3332 2.0823 1.3468 2.0239 3.0664 1.8143 1.4779 1.4764 1.1849 1.4585 1.3130 1.1964 1.2939 1.7621 1.4475 1.8655 1.4680 1.3608 1.3135 1.3027 2.4696 1.1695 1.7200 1.4879 1.5075 1.3114 1.3961 1.2007 1.2269 1.1439 1.1194 1.0362 1.0363 1.1439 1.2235 1.1085 1.5043 1.0651 1.3871 5.5372 6.0048 5.4523 12.6252 1.0491 1.0624 1.0660 1.0379 1.0355 1.1014 1.0864 1.0970 1.0911 1.0626 1.0921 1.0607 1.1054 1.0949 1.1051 1.1054 1.1059 1.1029 1.1163 1.1176
irintensity: 0.0534 6.3606 6.8951 0.6099 1.8445 1.4556 0.7813 0.8426 2.4119 2.8604 5.7509 2.1415 0.4682 3.4589 2.9499 2.2246 1.3775 0.3141 1.5577 4.6569 1.0432 7.4853 1.6635 3.2878 2.7791 1.3861 36.1378 15.3933 9.6933 0.1776 0.3876 1.4069 0.7441 10.3592 2.3699 4.5495 4.8685 5.1970 17.5865 43.3907 12.8835 113.4204 40.2468 12.4050 23.8894 1.6043 1.7528 4.5550 5.6602 4.8684 16.0325 7.4074 3.7489 3.7642 3.7977 16.4727 15.0791 0.4824 26.6262 1.6789 4.5649 5.3036 4.3042 3.4367 14.4435 16.2267 6.9405 0.1518 7.0629 0.9284 40.4451 0.0240 4.3211 12.6403 12.6280 8.6038 23.6970 4.7068 37.4156 12.3648 51.8242 315.2351 11.1242 8.5006 15.3694 11.6074 14.2192 18.1605 28.3345 0.0712 33.6780 10.8072 7.1926 1.0765 7.6396 7.1823 1.3416 8.8362 4.7006 0.9998 0.9672 7.4880 1.7758 12.5070 1.8968
temp: 298.150 k
press: 1.00000 atm
elementType: 6 6 6 6 6 6 1 1 1 1 1 1 1 6 1 6 46 17 17 6 7 1 1 6 1 1 1 7 6 1 1 1 6 1 1 1 1
symmnumber: 1
zpe: 790772.0 jmol-1
zpe.correction: 0.301189 hartree
zpe.thermalcorrener: 0.324551 hartree
zpe.thermalcorrenthalpy: 0.325495 hartree
zpe.thermalcorrgfe: 0.246078 hartree
zpe.sumelectzpe: -1624.805674 hartree
zpe.sumelectthermal: -1624.782312 hartree
zpe.sumelectthermalent: -1624.781368 hartree
zpe.sumelectthermalfe: -1624.860785 hartree
dipole: 0.0702 -3.9147 -1.8847
dipole: 4.3453
quadrupole: -87.2094 -124.9964 -140.5123
quadrupole: 3.2143 -15.5900 -4.2527
quadrupole: 30.3633 -7.4237 -22.9396 3.2143 -15.5900 -4.2527
hfenergy: -1625.1068634 hartree
pointgroup: C01 [X(C12H20Cl2N2Pd1)]
dipole: -0.0763254 -1.6872798 -0.2643746 debye
polarizability: 243.7042973|-5.2419166|192.0559078|7.0609277|-4.3525308|179.5671725 unknown
InChI: InChI=1S/C10H17N.C2H3N.2ClH.Pd/c1-5-7-8-9-10(6-2)11(3)4;1-2-3;;;/h5-6,9H,1-2,7-8H2,3-4H3;1H3;2*1H;/q;;;;+2/p-2
charge 0 multiplicity 1
37 atoms
C  -1.29878878 1.94206642 0.81810165
C  -0.5344079 2.62981505 -0.3256564
C  -2.84116454 -0.1087078 -0.77749737
C  -0.80656809 2.12691244 -1.71151243
C  -3.98192089 0.57793961 -0.68925055
C  -1.32899384 2.85988654 -2.69980121
H  -2.371338 2.1846151 0.73431808
H  0.54138822 2.50860538 -0.10299051
H  -0.52642847 1.08210882 -1.90638623
H  -4.39118805 0.89459038 0.27464764
H  -4.54027154 0.85322754 -1.58662395
H  -1.61012702 3.90719045 -2.54311186
H  -1.48664737 2.44618618 -3.69938521
C  -1.10999358 0.43306836 1.01228339
H  -0.93148617 0.19652136 2.06972451
C  -2.02761421 -0.49941462 0.40524033
Pd 0.79603061 -0.18631196 0.34500344
Cl 1.59945979 1.06467594 2.11511811
Cl 0.02854164 -1.54769627 -1.40928044
C  3.81686708 -0.83351701 -0.52708222
N  2.72622715 -0.62987392 -0.21312032
H  -2.41987683 -0.42961775 -1.73733288
H  -0.75130484 3.71023881 -0.28289064
C  5.19407263 -1.08380634 -0.92120822
H  5.843413 -1.07126767 -0.03588113
H  5.27160884 -2.06256819 -1.41261619
H  5.52751564 -0.30517479 -1.62002806
N  -2.16586041 -1.74053117 0.86165271
C  -1.29324046 -2.23358153 1.91160412
H  -0.24551039 -2.21124849 1.55350522
H  -1.35959265 -1.61143418 2.81423426
H  -1.57952746 -3.26142764 2.16207246
C  -2.86242367 -2.77013857 0.10141976
H  -3.35009706 -3.46927823 0.79398427
H  -3.62442412 -2.32056794 -0.54309505
H  -2.13298723 -3.3083988 -0.52414868
H  -0.93792805 2.40341649 1.74847862
