program: Gaussian 16
title: Title Card Required
version: ES64L-G16RevC.01
frameworkgroup: C1[X(C10H17Cl2N3Pd)]
method: RMN15
basis: def2SVP
operation: Freq
keyword: #N
keyword: Geom=AllCheck
keyword: Guess=TCheck
keyword: SCRF=Check
keyword: GenChk
keyword: RMN15/def2SVP
keyword: Freq
converged: YES YES NO YES
title: Mulliken charges:
elementType: C C C C C C H H H H H H H C C H Pd Cl Cl C N N H N H C H H H H H H H
charge: 0.081703 0.034978 -0.035538 -0.114487 -0.036940 0.090517 0.002870 0.018605 0.029356 0.011255 0.000275 0.067068 0.048446 -0.050920 -0.035884 0.026209 -0.082728 -0.315370 -0.333662 -0.276502 0.209486 -0.089536 0.035102 -0.107088 0.015605 0.086067 0.081011 0.080903 0.079622 0.116398 0.125004 0.125286 0.112890
chargesum: -0.00000
title: Mulliken charges with hydrogens summed into heavy atoms:
elementType: C C C C C C C C Pd Cl Cl C N N N C
charge: 0.100178 0.053583 -0.035538 -0.085130 -0.025410 0.206031 -0.015818 -0.009675 -0.082728 -0.315370 -0.333662 -0.276502 0.209486 0.148640 0.134314 0.327602
1716.lowfreq: -569.5584 -2.4095 -0.0021 -0.0018 -0.0015 4.4875 5.5425 16.3466 21.9117
frequency: -569.5584 16.3168 21.8726 31.9527 33.0432 52.7509 62.4320 83.3800 103.3146 108.5919 133.6976 146.1108 172.9059 196.1253 215.8164 243.0725 244.4806 267.2005 277.8696 279.8020 308.4075 336.2790 362.1408 364.2032 375.3472 398.5383 406.3860 430.2954 446.3373 450.6794 464.0538 473.8480 535.9290 600.2586 637.6057 669.9684 680.9204 754.0478 819.8205 833.1902 849.6434 861.5911 907.6653 941.3193 970.9011 983.4091 1002.3455 1013.1425 1024.6843 1025.5972 1038.6171 1061.2742 1101.5109 1136.2415 1146.0047 1154.3606 1190.7889 1212.5330 1237.3253 1253.2215 1271.0470 1340.0574 1343.9043 1370.8321 1400.3240 1419.5521 1420.0475 1421.0020 1435.7071 1466.6022 1493.7629 1571.3748 1578.8942 1582.6945 1735.2228 2469.3751 3099.8749 3142.0760 3148.7868 3160.3290 3168.7749 3189.3214 3191.4077 3203.6317 3208.9558 3210.3463 3251.7270 3263.4820 3296.6594 3572.2136 3602.7783 3684.6743 3731.9762
redmass: 8.1923 1.0147 5.9366 5.1653 4.1770 4.3365 4.4763 3.9270 6.1928 11.9617 7.2432 10.6340 6.9630 7.1510 5.7177 2.7308 4.1846 5.8027 2.2708 1.8218 15.8899 2.2242 3.4695 2.0620 4.5273 1.9665 2.0964 4.3098 2.9996 2.4720 3.0236 1.8416 2.7179 1.5495 1.8946 2.8303 1.9584 1.4986 1.6059 1.9504 1.3783 1.6021 1.6623 1.3643 1.5800 3.7594 1.2688 1.2782 1.4764 1.4738 1.1523 1.2698 1.3993 1.3970 1.2155 1.1946 1.2987 1.8064 1.8036 1.7142 1.3737 1.4808 1.2960 1.3127 1.1941 1.0362 1.0364 1.7784 1.3585 1.9256 2.3096 1.9719 1.2326 1.7356 5.9327 12.6237 1.0355 1.0884 1.0595 1.0588 1.0889 1.0863 1.0639 1.0928 1.1050 1.1054 1.1122 1.1154 1.1183 1.0494 1.0483 1.0980 1.1004
irintensity: 263.1275 0.0327 0.9301 6.7829 9.0890 1.2120 2.6047 2.7663 1.6328 1.5341 2.6081 0.8194 7.5482 7.6934 0.8635 93.3823 39.4783 40.0437 146.6324 34.8634 2.4232 21.0941 49.6464 77.2470 18.3894 17.4033 9.3828 1.7267 37.8719 56.3049 36.1924 72.3946 53.3705 65.0229 50.5466 58.1080 7.7222 31.2441 106.9289 51.3290 5.3207 109.3622 30.8868 64.7880 13.3892 0.5623 39.5981 17.4218 5.7736 5.0422 16.2696 0.8602 3.6750 24.3223 18.9027 1.1606 61.4684 3.9875 26.2954 30.3868 5.2198 7.5523 4.6156 0.0367 2.3987 12.3951 12.4106 21.3282 17.4159 21.0941 24.9307 83.8147 72.1142 36.0659 97.6862 8.1640 0.3538 6.3987 17.1646 8.3450 4.0948 0.1789 0.9499 3.2159 0.6533 0.7572 2.0003 2.0393 6.3036 16.5983 39.5275 16.4788 28.3506
temp: 298.150 k
press: 1.00000 atm
elementType: 6 6 6 6 6 6 1 1 1 1 1 1 1 6 6 1 46 17 17 6 7 7 1 7 1 6 1 1 1 1 1 1 1
symmnumber: 1
zpe: 685451.8 jmol-1
zpe.correction: 0.261075 hartree
zpe.thermalcorrener: 0.282152 hartree
zpe.thermalcorrenthalpy: 0.283096 hartree
zpe.thermalcorrgfe: 0.207734 hartree
zpe.sumelectzpe: -1601.594753 hartree
zpe.sumelectthermal: -1601.573676 hartree
zpe.sumelectthermalent: -1601.572732 hartree
zpe.sumelectthermalfe: -1601.648094 hartree
dipole: -2.2524 -1.2994 0.5481
dipole: 2.6575
quadrupole: -64.1945 -131.2479 -118.8136
quadrupole: 6.3119 -8.0628 -9.4108
quadrupole: 40.5575 -26.4959 -14.0616 6.3119 -8.0628 -9.4108
hfenergy: -1601.8558278 hartree
pointgroup: C01 [X(C10H17Cl2N3Pd1)]
dipole: 0.8920317 0.5451998 0.0131137 debye
polarizability: 265.255036|8.0808976|191.4561465|-19.9770124|3.7910281|164.7290688 unknown
InChI: InChI=1S/C8H14N2.C2H3N.2ClH.Pd/c1-3-8(10)6-4-5-7(2)9;1-2-3;;;/h3-5,8H,1-2,6,9-10H2;1H3;2*1H;/q;;;;+2/p-2
charge 0 multiplicity 1
33 atoms
C  2.48273764 1.60915497 -0.02048086
C  0.77820756 1.4189202 0.38660074
C  3.1084506 -1.30324767 -1.2509746
C  0.44757048 0.0575878 -0.09525632
C  2.94396868 -2.49935188 -1.84586687
C  0.64971673 -0.16062437 -1.50842627
H  2.91740742 0.93246391 0.71938182
H  0.2795794 2.19239768 -0.21270625
H  0.82068832 -0.74967448 0.55193328
H  2.34210392 -2.59234822 -2.75168461
H  3.37508066 -3.40975463 -1.4239129
H  0.51663573 -1.18331759 -1.87479462
H  0.22540942 0.60438217 -2.16813304
C  2.62146594 1.23583908 -1.39044503
C  2.52050396 -0.07822045 -1.88386387
H  2.50184203 -0.1577674 -2.97574717
Pd -1.62262837 -0.1583879 -0.07590782
Cl -1.31471992 -2.02970115 1.23656957
Cl -1.93091309 1.7452147 -1.40190481
C  -4.79899904 -0.52993346 0.09466027
N  -3.6556644 -0.39919234 0.02637546
N  3.77706961 -1.13267629 -0.03895797
H  2.45627209 2.02805752 -2.13021673
N  0.61136863 1.64033238 1.75805017
H  2.67591565 2.66735645 0.18950459
C  -6.24092233 -0.69705685 0.18275203
H  -6.52663867 -0.93273942 1.21644361
H  -6.74472206 0.22750898 -0.12856259
H  -6.56197302 -1.51818041 -0.47180734
H  0.74172019 2.58221688 2.10859202
H  0.93034031 0.90500539 2.3833115
H  4.41100453 -0.33596695 -0.01356982
H  4.21558894 -1.9777379 0.31833241
