program: Gaussian 16
title: Title Card Required
version: ES64L-G16RevC.01
frameworkgroup: C1[X(C16H19Cl2NPd)]
method: RMN15
basis: def2SVP
operation: Freq
keyword: #N
keyword: Geom=AllCheck
keyword: Guess=TCheck
keyword: SCRF=Check
keyword: GenChk
keyword: RMN15/def2SVP
keyword: Freq
converged: YES YES NO NO
title: Mulliken charges:
elementType: C C C C C C H H H H H H H C C H Pd Cl Cl C N H H C H H H H C C C C H C H C H H H
charge: -0.018334 0.131722 -0.031952 -0.161366 -0.015816 0.216339 0.009910 0.072815 0.069259 0.015341 0.023818 0.036942 -0.003013 -0.047840 -0.020464 -0.009968 -0.123192 -0.276802 -0.277658 -0.248950 0.183574 0.017418 0.083755 0.083136 0.090363 0.090394 0.088412 0.004776 0.077202 -0.018763 -0.016786 0.018729 -0.027389 0.022024 -0.014473 0.025008 -0.016801 -0.016202 -0.015169
chargesum: -0.00000
title: Mulliken charges with hydrogens summed into heavy atoms:
elementType: C C C C C C C C Pd Cl Cl C N C C C C C C C
charge: 0.008994 0.288292 -0.027175 -0.092107 0.023342 0.250268 -0.047840 -0.030432 -0.123192 -0.276802 -0.277658 -0.248950 0.183574 0.352306 0.077202 -0.046152 -0.031259 0.001928 0.005822 0.009839
chargesum: 0.00000
1716.lowfreq: -3.2539 -0.0017 -0.0014 0.0013 2.5342 6.7806 11.1491 16.5512 19.4078
frequency: 11.1405 15.5020 19.3664 27.3744 37.6129 46.0055 55.8836 73.8197 86.5017 100.4142 111.1467 128.8817 136.6114 160.9236 169.0586 178.6828 198.0040 228.5627 246.0613 273.4190 274.7457 285.7666 326.4828 364.3148 378.0307 383.9139 403.8534 413.7394 420.2380 422.3860 427.3403 447.7757 515.5673 527.5606 603.5994 614.6161 650.7689 698.1331 711.6682 725.2543 771.4140 794.9055 808.7840 842.0122 867.5780 879.2060 929.4204 937.1558 959.9441 960.7620 977.5358 980.0645 992.8502 996.0411 1017.3358 1021.5290 1023.3892 1024.0162 1024.2394 1043.2888 1044.8146 1058.2356 1090.6790 1106.2289 1108.7044 1152.6402 1175.4799 1183.1300 1219.0815 1252.4067 1264.6621 1269.5841 1295.4835 1312.4295 1322.0178 1366.1254 1369.2174 1373.3621 1391.4208 1405.1049 1415.6213 1416.6705 1424.3924 1435.3061 1475.8234 1532.1029 1596.6360 1657.6664 1689.2485 1715.8977 1741.1096 2475.5220 3092.0178 3101.1863 3102.3235 3169.3793 3171.9091 3174.2124 3187.4477 3194.2543 3204.0350 3212.2569 3213.8897 3222.0345 3229.2566 3237.1302 3242.8810 3250.2912 3280.1280 3287.3788 3293.9626
redmass: 1.0154 5.4255 7.2500 4.9087 4.8973 3.8787 3.9064 5.8178 4.7065 4.3466 10.5466 4.5944 3.7011 11.2592 8.1089 3.8504 5.1942 5.1800 3.5775 2.4432 8.9132 2.8692 31.1756 3.8839 3.4512 15.0939 2.2409 2.5581 2.9239 3.8058 3.8880 4.8308 3.0187 3.1667 3.2787 5.6296 2.6210 1.5646 1.4651 1.2479 2.7620 1.5242 1.9442 2.3230 1.2506 1.4611 1.6193 1.3798 1.4966 1.3142 1.5638 1.8766 1.8042 4.9750 1.3837 1.6165 1.4897 1.4599 1.2972 1.2949 1.3408 2.3309 1.7100 1.5823 1.6872 1.0674 1.8331 1.2446 1.3910 1.3193 1.5194 1.3034 1.3674 1.3964 1.3333 2.4970 1.3112 3.5575 1.1847 1.2028 1.0359 1.0364 1.3300 1.1859 2.5975 2.7681 3.8729 6.3500 6.7696 6.1684 5.5454 12.6427 1.0668 1.0353 1.0822 1.1025 1.0613 1.0575 1.0696 1.0857 1.0908 1.1051 1.1056 1.0855 1.0886 1.0928 1.0963 1.1006 1.1168 1.1164 1.1202
irintensity: 0.0306 1.0372 0.8735 3.9816 4.6356 1.4800 1.2997 1.0360 0.9977 0.4573 0.5282 2.6317 2.0660 4.0172 0.5119 0.6765 2.9404 5.5252 1.2007 1.5739 3.5813 1.3837 0.7775 3.3220 4.8754 48.3739 1.3873 0.2677 0.1836 0.0071 1.4488 0.3030 16.1681 6.0809 7.4760 0.8430 5.2986 3.0017 4.5672 33.1854 2.8375 6.7151 19.3324 0.6226 0.0483 4.3771 0.3503 29.8670 2.1747 38.3880 4.3643 18.0508 7.2856 0.9565 0.0284 1.4789 6.1618 7.2709 8.0735 3.6873 1.0252 7.0036 6.9366 9.0908 6.8926 0.0029 1.7793 1.3226 15.1328 11.2355 1.6656 0.7234 3.6766 1.1486 1.2430 1.4277 0.3237 4.6797 12.4361 13.5402 13.6496 14.0098 2.6532 11.6723 5.5487 11.7259 18.1444 3.6725 2.7984 8.8262 8.2772 43.5203 2.3582 0.7415 15.0723 11.8705 7.3714 0.6661 0.1290 4.3935 0.2635 2.2932 2.4450 2.2146 0.8071 10.8599 19.9265 10.2074 7.5423 10.6167 0.3991
temp: 298.150 k
press: 1.00000 atm
elementType: 6 6 6 6 6 6 1 1 1 1 1 1 1 6 6 1 46 17 17 6 7 1 1 6 1 1 1 1 6 6 6 6 1 6 1 6 1 1 1
symmnumber: 1
zpe: 813191.4 jmol-1
zpe.correction: 0.309728 hartree
zpe.thermalcorrener: 0.333430 hartree
zpe.thermalcorrenthalpy: 0.334374 hartree
zpe.thermalcorrgfe: 0.250506 hartree
zpe.sumelectzpe: -1721.666922 hartree
zpe.sumelectthermal: -1721.643220 hartree
zpe.sumelectthermalent: -1721.642276 hartree
zpe.sumelectthermalfe: -1721.726143 hartree
dipole: -3.6606 -1.7856 1.8164
dipole: 4.4595
quadrupole: -97.4936 -150.7336 -142.4533
quadrupole: 18.2143 -13.9306 -2.4889
quadrupole: 32.7333 -20.5068 -12.2265 18.2143 -13.9306 -2.4889
hfenergy: -1721.9766499 hartree
pointgroup: C01 [X(C16H19Cl2N1Pd1)]
dipole: -1.4403263 -0.7024185 0.714425 debye
polarizability: 291.2161853|-17.5459149|237.6797443|-11.6528074|-17.3165505|183.4953514 unknown
InChI: InChI=1S/C14H16.C2H3N.2ClH.Pd/c1-4-9-13(5-2)12(3)14-10-7-6-8-11-14;1-2-3;;;/h4-8,10-11,13H,1-3,9H2;1H3;2*1H;/q;;;;+2/p-2
charge 0 multiplicity 1
39 atoms
C  2.74522191 1.56530993 -1.44854031
C  -0.36510862 0.41275397 -1.44088829
C  1.88148732 2.69791477 1.16827979
C  -0.20520602 1.00963057 -0.20252823
C  2.18407062 3.31094906 2.31474716
C  0.6867917 0.4813132 0.87995578
H  2.03275389 2.3875626 -1.54838589
H  0.12868503 -0.53926731 -1.65637374
H  -0.57369748 2.03574566 -0.08821579
H  2.60444124 2.75605929 3.16004622
H  2.02685613 4.38352714 2.450179
H  0.19293013 0.61593109 1.85580315
H  0.83779945 -0.59649615 0.72617671
C  2.90744446 0.90356472 -0.28970102
C  2.05694494 1.21957738 0.93527986
H  2.57782798 0.81784487 1.81907792
Pd -2.12825961 -0.06721618 -0.29653857
Cl -3.07741931 1.95808938 -0.83666775
Cl -1.22965364 -2.13904247 0.15998018
C  -4.9907216 -1.18783601 0.56488251
N  -3.95764635 -0.77549261 0.26432483
H  3.30909639 1.29324768 -2.34392691
H  -0.80196422 0.97756836 -2.26898472
C  -6.29356397 -1.70784383 0.9431189
H  -7.08258909 -1.14761222 0.42441726
H  -6.36223835 -2.76946643 0.67139277
H  -6.43193881 -1.60479558 2.02755619
H  1.46281725 3.28985834 0.34607027
C  3.90946972 -0.19205403 -0.17008564
C  5.09850183 -0.15828258 -0.91979799
C  3.70550976 -1.28507731 0.68924813
C  6.03496159 -1.18621336 -0.83294013
H  5.30050323 0.70399762 -1.55923487
C  4.64041024 -2.31764838 0.77428536
H  2.79558515 -1.34795358 1.28974719
C  5.80849418 -2.27477309 0.01273675
H  6.95424658 -1.13084908 -1.4204834
H  4.45035568 -3.16209302 1.44041567
H  6.5426637 -3.08021342 0.08350567
