program: Gaussian 16
title: Title Card Required
version: ES64L-G16RevC.01
frameworkgroup: C1[X(C10H16Cl2N2Pd)]
method: RMN15
basis: def2SVP
operation: Freq
keyword: #N
keyword: Geom=AllCheck
keyword: Guess=TCheck
keyword: SCRF=Check
keyword: GenChk
keyword: RMN15/def2SVP
keyword: Freq
converged: YES YES YES YES
title: Mulliken charges:
elementType: C C C C C C H H H H H H H C C H Pd Cl Cl C N H H H H H C H H H N
charge: 0.007744 0.090456 -0.094967 -0.142761 -0.020850 0.174351 0.021177 0.068637 0.058301 -0.007451 -0.019723 0.016924 0.026886 -0.076768 0.044098 0.008624 -0.144080 -0.282202 -0.264143 -0.262781 0.190198 0.022910 0.083720 -0.006634 0.114784 0.122392 0.084505 0.085435 0.088550 0.088935 -0.076263
chargesum: -0.00000
title: Mulliken charges with hydrogens summed into heavy atoms:
elementType: C C C C C C C C Pd Cl Cl C N C N
charge: 0.051832 0.242812 -0.094967 -0.084460 -0.048024 0.218161 -0.083403 0.052722 -0.144080 -0.282202 -0.264143 -0.262781 0.190198 0.347424 0.160912
chargesum: 0.00000
1716.lowfreq: -8.3325 -2.6863 -0.0025 -0.0023 -0.0019 3.2082 22.5667 29.2014 33.1184
frequency: 22.5374 29.1812 33.0813 34.8413 55.7935 77.8016 103.7172 107.3332 115.5209 145.8702 156.2300 157.6759 192.0264 201.1688 220.2842 222.2460 257.3147 305.7937 309.8407 322.0898 354.7433 363.8742 389.2992 414.1291 420.5021 443.1503 465.2299 470.2745 500.7424 543.2061 592.1596 666.6490 705.6281 729.1261 737.7133 819.0219 844.7188 877.4619 901.9713 956.9953 968.9875 974.7310 979.9022 991.0919 1019.1718 1023.0513 1025.2576 1033.0646 1053.5443 1083.2727 1091.6623 1144.7432 1208.0679 1252.9363 1268.3133 1291.1361 1301.1691 1317.6287 1369.7253 1392.2878 1395.5837 1407.9996 1410.7010 1413.9230 1416.9572 1417.4899 1577.8633 1584.3222 1734.2359 1745.3735 2470.4425 3050.1517 3088.1688 3100.8315 3157.0162 3166.6776 3176.7370 3178.5902 3181.3675 3187.6968 3211.1932 3213.0719 3283.6359 3294.7656 3296.9948 3563.9464 3691.7576
redmass: 1.0300 4.6972 5.4856 4.1552 5.5281 5.8426 4.0335 4.4059 7.2870 9.3429 13.6682 3.4608 5.6059 2.8388 3.6422 4.9891 8.3532 2.4215 4.4509 11.2530 2.8762 5.8977 5.0879 1.9400 3.5198 4.5927 1.4172 2.5557 2.1840 1.5906 1.2448 2.2299 1.6759 1.3736 1.3662 2.3939 1.5060 1.7974 1.6856 1.3714 1.5517 1.5876 1.9414 1.6073 1.2431 1.4848 1.4801 1.2124 1.3248 1.7011 1.4798 1.6639 1.2469 1.6429 1.3005 1.3917 1.4600 1.3768 1.3095 2.0410 1.1118 1.2873 1.2599 1.4953 1.0361 1.0363 1.2448 3.5431 5.5725 6.3123 12.6344 1.0698 1.0847 1.0354 1.0957 1.0775 1.0589 1.0878 1.0764 1.0630 1.1050 1.1056 1.1171 1.1200 1.1170 1.0516 1.0973
irintensity: 0.1132 4.1357 1.0228 5.0236 1.2274 0.5009 0.2345 0.1916 1.8980 13.8314 6.3458 0.5887 4.6353 3.7443 2.2296 5.5562 3.3826 2.0215 0.8982 2.6038 6.0113 25.2064 18.1149 5.6170 1.7949 0.2898 7.7548 5.0295 6.4350 44.2043 309.3608 6.0490 7.0160 0.8739 3.6489 1.8652 52.0279 4.4009 9.0806 11.6109 26.1267 6.1730 15.0269 15.8136 4.7621 7.4355 5.2293 15.9898 7.8379 0.8847 8.2496 6.6242 0.9332 1.0099 1.6281 1.2154 4.5768 3.6191 0.5277 29.3078 15.2282 9.0623 5.6767 26.3496 14.1777 13.4669 44.9904 9.2179 7.5876 129.8087 32.2026 14.9101 11.9837 0.3146 1.0357 13.4226 0.2839 0.3940 3.2145 3.4662 2.0480 1.8012 7.3387 0.2005 7.8958 25.4059 23.2396
temp: 298.150 k
press: 1.00000 atm
elementType: 6 6 6 6 6 6 1 1 1 1 1 1 1 6 6 1 46 17 17 6 7 1 1 1 1 1 6 1 1 1 7
symmnumber: 1
zpe: 642838.4 jmol-1
zpe.correction: 0.244844 hartree
zpe.thermalcorrener: 0.264967 hartree
zpe.thermalcorrenthalpy: 0.265911 hartree
zpe.thermalcorrgfe: 0.193316 hartree
zpe.sumelectzpe: -1546.420419 hartree
zpe.sumelectthermal: -1546.400297 hartree
zpe.sumelectthermalent: -1546.399353 hartree
zpe.sumelectthermalfe: -1546.471947 hartree
dipole: 3.1404 2.1295 2.4609
dipole: 4.5225
quadrupole: -84.9299 -120.3889 -120.3381
quadrupole: 15.5191 12.7698 13.9001
quadrupole: 23.6224 -11.8366 -11.7858 15.5191 12.7698 13.9001
hfenergy: -1546.6652634 hartree
pointgroup: C01 [X(C10H16Cl2N2Pd1)]
dipole: 0.9628165 -1.4731838 0.2618385 debye
polarizability: 184.5557593|-17.7980064|168.2755879|5.8917503|-3.6985085|177.7827507 unknown
InChI: InChI=1S/C8H13N.C2H3N.2ClH.Pd/c1-4-6-8(5-2)7(3)9;1-2-3;;;/h4-5,8H,1-3,6,9H2;1H3;2*1H;/q;;;;+2/p-2
charge 0 multiplicity 1
31 atoms
C  -4.23660041 -0.84112335 -1.28636977
C  -0.06172238 2.53722777 -0.64531491
C  -2.44572698 -0.686734 1.06547447
C  -1.20498256 1.74974027 -0.61251768
C  -2.68990392 -1.174542 2.29407965
C  -2.24223531 1.78616773 0.47327268
H  -3.97619774 -1.78658975 -0.79990374
H  0.18964219 3.18321112 0.20046547
H  -1.50498922 1.27533124 -1.55661618
H  -3.40878871 -0.68353692 2.95054573
H  -2.15261734 -2.04484929 2.67957154
H  -1.76390357 1.97464644 1.44507216
H  -2.88971572 2.65459907 0.24772161
C  -3.89052731 0.33370314 -0.75337322
C  -3.15852001 0.54774303 0.55352562
H  -3.92423497 0.78977952 1.30987714
Pd 0.56735796 0.56400288 -0.10384578
Cl 0.53774692 -0.13826063 -2.31477382
Cl 0.66329813 1.2696479 2.09056298
C  2.8113072 -1.61478591 0.6405128
N  1.98961864 -0.85841536 0.35521458
H  -4.79993002 -0.89608699 -2.22051255
H  0.46425903 2.69212614 -1.59075471
H  -4.18216489 1.25571165 -1.27366663
H  -1.61960071 -1.11076175 -0.79343274
H  -1.05533356 -2.08871942 0.47831839
C  3.85422414 -2.55984271 1.00354999
H  3.74363166 -3.48322837 0.41997365
H  4.83833383 -2.11979845 0.79429168
H  3.78709198 -2.79521743 2.07390744
N  -1.47328732 -1.20229657 0.21185216
