program: Gaussian 16
title: Title Card Required
version: ES64L-G16RevC.01
frameworkgroup: C1[X(C12H20Cl2N2Pd)]
method: RMN15
basis: def2SVP
operation: Freq
keyword: #N
keyword: Geom=AllCheck
keyword: Guess=TCheck
keyword: SCRF=Check
keyword: GenChk
keyword: RMN15/def2SVP
keyword: Freq
converged: YES YES NO NO
title: Mulliken charges:
elementType: C C C C C C H H H H H H H H C H C H Pd Cl Cl C N N C H H H C H H H H C H H H
charge: 0.162778 0.031499 -0.037438 -0.072131 -0.015218 0.127248 -0.000111 -0.015886 0.060268 0.021797 0.013355 0.025362 0.079779 0.067587 -0.062745 -0.007118 -0.001255 -0.001579 -0.104891 -0.271230 -0.280554 -0.252357 0.189056 -0.317377 0.133363 0.009013 -0.016880 0.025137 0.123504 -0.009939 0.015991 0.024497 0.006941 0.084023 0.088128 0.088855 0.088530
chargesum: -0.00000
title: Mulliken charges with hydrogens summed into heavy atoms:
elementType: C C C C C C C C Pd Cl Cl C N N C C C
charge: 0.176021 0.015613 -0.030497 -0.011863 0.031942 0.274614 -0.069863 -0.002834 -0.104891 -0.271230 -0.280554 -0.252357 0.189056 -0.317377 0.150633 0.154053 0.349536
chargesum: 0.00000
1716.lowfreq: -3.6773 -0.0030 -0.0006 0.0009 3.3229 7.5733 15.3999 20.6067 24.6179
frequency: 15.3601 20.5795 24.6073 31.8425 45.8008 54.4370 66.0816 79.4874 93.2473 109.1471 118.6740 133.5798 156.4887 161.4996 175.8634 194.1172 220.1395 225.3752 231.3686 255.5045 260.4725 275.9279 285.4992 320.7190 341.3319 364.6401 376.3571 392.6219 418.0816 422.8159 433.2079 444.1614 454.5543 527.2036 554.4725 614.2659 701.4028 761.5876 786.2176 855.4591 885.6352 918.8511 956.5860 963.9121 981.3874 994.3727 1005.9640 1023.5233 1024.5356 1025.7968 1029.8574 1043.1854 1064.7019 1068.9445 1084.2244 1089.1993 1097.1678 1130.4700 1158.7007 1196.8853 1243.2506 1253.1853 1268.1306 1274.5595 1295.1066 1312.1483 1329.6798 1369.6131 1384.2666 1397.1588 1405.4820 1410.4161 1416.2155 1417.0354 1420.7784 1432.6418 1435.3882 1437.1204 1449.1311 1455.9265 1470.4179 1603.1644 1719.1303 1739.6865 2475.8159 2969.4932 2983.4504 3048.2272 3100.9950 3105.5711 3113.1042 3114.5677 3121.6964 3160.5642 3167.3856 3170.4898 3176.8964 3178.7941 3188.0891 3198.9968 3204.3982 3211.7337 3213.6091 3288.0743 3294.3236
redmass: 1.0155 4.3626 4.5005 4.1838 5.7256 5.7446 3.5456 2.5956 5.4838 4.3639 10.2652 2.7540 9.8672 6.5675 3.5373 4.4425 3.1742 1.2481 3.0676 2.0459 1.3241 7.4018 3.1852 27.2874 3.1597 2.8918 16.8244 3.0085 2.3382 4.0083 2.2893 4.0091 3.3485 2.4299 3.0860 1.5371 1.8849 1.3216 1.6842 1.7695 2.6068 2.3810 1.3620 1.5660 2.1135 1.6216 1.3369 1.4866 1.4695 1.2853 1.1841 1.4618 1.3712 1.5073 1.7878 2.6271 1.3554 1.6455 1.4957 1.5003 1.3008 1.3042 1.5124 1.4175 1.2472 1.7309 2.2546 1.3113 1.4939 1.2766 1.2217 1.1391 1.0359 1.0364 1.2608 1.0861 1.1655 1.4223 1.1251 1.1315 1.1043 4.0592 5.2882 7.7558 12.6415 1.0558 1.0547 1.0658 1.0353 1.0888 1.0810 1.0807 1.0947 1.1040 1.0859 1.1048 1.0576 1.0693 1.0828 1.0945 1.0901 1.1051 1.1056 1.1176 1.1198
irintensity: 0.0186 0.9852 3.2844 3.9423 3.5059 1.9553 0.2290 0.6536 0.1756 0.3223 1.6147 1.1168 2.7267 3.0732 2.1834 3.5669 1.2513 0.7566 3.9281 0.1983 0.5761 3.2041 1.7794 1.3640 2.5922 7.2881 49.9154 3.7830 5.2859 0.4874 2.8437 5.3318 14.9434 11.7640 0.2018 29.9720 7.0166 3.9591 8.7180 1.2885 20.4917 1.2728 29.6681 25.1760 8.5372 6.6216 15.1198 6.7884 5.4388 4.0036 10.1875 12.6700 4.8649 1.4989 26.4426 7.1987 8.1087 3.4244 10.0655 4.6854 5.1195 6.7004 11.4060 2.9451 1.0376 7.5585 23.1750 0.3625 7.1758 5.1370 4.6933 6.6111 14.0335 13.3347 7.5940 5.2859 4.8130 1.9441 9.2387 15.0535 13.8410 5.7260 3.4542 4.3227 37.2541 87.1813 114.9377 13.0804 0.4899 1.4859 43.3480 10.7221 5.1638 15.7105 3.2678 12.5959 0.2242 11.3250 11.1294 17.4187 0.6825 2.1968 2.1065 9.5766 0.5085
temp: 298.150 k
press: 1.00000 atm
elementType: 6 6 6 6 6 6 1 1 1 1 1 1 1 1 6 1 6 1 46 17 17 6 7 7 6 1 1 1 6 1 1 1 1 6 1 1 1
symmnumber: 1
zpe: 790576.2 jmol-1
zpe.correction: 0.301115 hartree
zpe.thermalcorrener: 0.324323 hartree
zpe.thermalcorrenthalpy: 0.325267 hartree
zpe.thermalcorrgfe: 0.244175 hartree
zpe.sumelectzpe: -1624.788396 hartree
zpe.sumelectthermal: -1624.765187 hartree
zpe.sumelectthermalent: -1624.764243 hartree
zpe.sumelectthermalfe: -1624.845335 hartree
dipole: -3.6889 1.4543 1.9412
dipole: 4.4149
quadrupole: -85.7773 -139.7852 -131.5722
quadrupole: -6.8412 -9.2268 9.4192
quadrupole: 33.2676 -20.7403 -12.5273 -6.8412 -9.2268 9.4192
hfenergy: -1625.0895102 hartree
pointgroup: C01 [X(C12H20Cl2N2Pd1)]
dipole: -1.4513631 0.5720981 0.7637082 debye
polarizability: 250.6946769|-19.0955469|178.8042777|-2.0445837|-5.3237876|176.8614896 unknown
InChI: InChI=1S/C10H17N.C2H3N.2ClH.Pd/c1-5-7-8-9-10(6-2)11(3)4;1-2-3;;;/h5-8,10H,1-2,9H2,3-4H3;1H3;2*1H;/q;;;;+2/p-2
charge 0 multiplicity 1
37 atoms
C  2.9119792 0.80555617 0.25225747
C  1.38909368 0.82250557 0.01994202
C  5.47371784 -1.01747224 -0.07333039
C  0.90841602 -0.57043378 -0.30274389
C  5.74341494 -0.53157749 1.14765918
C  0.48040644 -1.00528497 -1.5418755
H  3.16712395 0.0892869 1.05095675
H  1.16573502 1.45713811 -0.85364854
H  1.07114874 -1.33127099 0.46905876
H  5.43584317 0.47476425 1.44508478
H  3.20631839 1.8061934 0.62162059
H  6.30776619 -1.11715407 1.8772117
H  0.33037326 -2.07357748 -1.71954999
H  0.47654071 -0.33091372 -2.40264277
C  3.6562951 0.46986877 -1.00411504
H  3.23715578 0.90245433 -1.92201338
C  4.7303218 -0.33033569 -1.13859561
H  5.08681077 -0.52146006 -2.15704135
Pd -1.27125221 -0.42943665 -0.39478638
Cl -1.25951335 -2.34633992 0.88199612
Cl -1.36336166 1.46828038 -1.72217439
C  -4.30297571 0.1037135 0.44002813
N  -3.20716218 -0.09237445 0.14302822
N  0.60251631 1.35632893 1.12546629
C  0.52675974 2.79765073 1.13561765
H  -0.1734885 3.12303303 1.91992696
H  1.50105112 3.29718731 1.33320843
H  0.13519491 3.14729613 0.16813344
C  0.83286976 0.75705148 2.41994252
H  1.83527177 0.97497088 2.84751887
H  0.08255333 1.13542886 3.13052362
H  0.69834165 -0.33532911 2.37084
H  5.86625485 -2.00735334 -0.33567761
C  -5.68571704 0.34962182 0.81262149
H  -6.35316363 -0.05670051 0.04110335
H  -5.90540138 -0.13807045 1.77145663
H  -5.85964377 1.42976438 0.90507088
