program: Gaussian 16
title: min nm2166_B irc ( for irc NM1549 (sub 2.17 from nm1243 for ts (from s can nm1140 freeze 1 2 at 2.2 and scan 5 6 (took nm1128.com andchanged both to p(ch3)2))))
version: ES64L-G16RevC.01
frameworkgroup: C1[X(C11H17Cl2NOPd)]
method: RMN15
basis: def2SVP
operation: Freq
keyword: #N
keyword: Geom=AllCheck
keyword: Guess=TCheck
keyword: SCRF=Check
keyword: GenChk
keyword: RMN15/def2SVPFreq
keyword: RMN15/def2SVP
keyword: Freq
title: min nm2166_B irc ( for irc NM1549 (sub 2.17 from nm1243 for ts (from s
converged: YES YES NO NO
title: Mulliken charges:
elementType: C C C C C C H H H H H H H H C H C H Pd Cl Cl C N H C H H H O C H H H
charge: -0.019620 0.137089 0.024488 -0.146176 0.126561 0.105198 -0.001211 0.057327 0.078010 0.000889 0.021081 0.027470 0.028440 0.030891 -0.029397 0.002023 -0.070296 -0.017185 -0.127000 -0.277055 -0.277500 -0.249158 0.183516 0.088145 0.083259 0.090236 0.088914 0.088903 -0.301375 0.163810 0.045940 0.019207 0.024574
chargesum: -0.00000
title: Mulliken charges with hydrogens summed into heavy atoms:
elementType: C C C C C C C C Pd Cl Cl C N C O C
charge: 0.000250 0.282562 0.024488 -0.068166 0.154920 0.164529 -0.027374 -0.087481 -0.127000 -0.277055 -0.277500 -0.249158 0.183516 0.351313 -0.301375 0.253531
chargesum: 0.00000
1716.lowfreq: -2.5537 -0.0024 -0.0022 -0.0013 2.9060 6.3049 11.3602 17.8893 27.7232
frequency: 11.3376 17.8763 27.7215 35.6303 42.2412 52.7790 82.4222 95.5073 109.5336 119.0533 134.2475 158.4313 167.5013 186.1393 194.2232 215.3383 219.6506 232.1607 273.3681 284.1807 291.2097 316.1200 326.5455 372.4239 383.0293 393.1063 422.9164 430.6009 447.2164 508.3904 524.0402 604.0772 625.3846 678.5507 760.1158 797.0155 850.3480 862.8885 913.8978 943.7029 964.5372 983.2365 996.2221 999.5046 1019.2239 1022.7193 1023.6532 1024.3752 1029.4888 1065.7695 1091.6142 1156.3410 1166.2121 1191.4846 1199.8897 1230.6310 1268.9551 1290.3163 1303.5019 1316.8126 1329.0185 1369.4407 1385.1854 1395.3454 1415.8014 1416.8676 1416.9855 1430.1052 1444.7407 1448.3145 1460.9349 1467.1500 1591.5363 1720.9015 1739.8362 2475.3831 3041.7640 3092.6642 3100.9896 3113.6957 3121.9401 3170.3530 3170.9006 3179.1485 3188.3838 3190.5549 3201.4809 3205.2072 3211.5302 3211.9434 3213.6491 3290.1026 3290.8927
redmass: 1.0122 5.1824 4.9624 5.2310 4.8771 4.7720 4.7848 2.9272 8.8222 5.3825 3.8137 13.2567 6.2544 3.6302 5.3128 2.3347 2.3400 4.7737 8.2064 1.7465 3.0841 1.9693 24.3222 2.5347 8.4468 3.7291 3.9517 2.3246 4.8027 2.5966 2.9329 2.1507 2.6998 1.9175 1.2618 2.1861 1.9738 1.5204 1.4737 1.3427 1.8677 2.7488 1.5293 1.7333 1.2988 1.5466 1.4864 1.4798 1.4151 1.3887 1.6089 2.7948 1.3085 1.4189 1.3512 1.3695 1.2796 1.2729 1.4920 1.5661 1.8796 1.3110 1.2363 1.4279 1.0360 1.0371 1.2648 1.3892 1.0631 1.1446 1.2120 1.1870 3.8543 5.3070 8.2989 12.6421 1.0366 1.0670 1.0353 1.0635 1.1058 1.0573 1.0816 1.1018 1.0800 1.0883 1.0932 1.1012 1.0891 1.1051 1.1056 1.1170 1.1201
irintensity: 0.0004 1.7118 5.6254 1.0812 4.8913 0.8944 0.1520 1.3278 0.2010 4.2675 2.6925 6.1637 1.1484 0.9848 3.2783 1.1766 0.6721 10.2980 4.0099 0.0890 1.4228 1.6573 1.0104 6.8906 40.9093 8.2455 0.3559 0.0351 0.1560 0.4232 11.0374 21.7760 3.0898 6.7593 3.0061 4.0940 7.7406 24.2506 3.7946 33.5232 0.7958 11.6394 17.7158 10.5062 2.1502 3.0512 9.9944 5.6511 6.9650 3.2732 1.6212 36.9679 2.0342 8.8674 11.7745 3.0138 1.3843 23.9322 32.0715 52.2757 77.3996 0.2040 11.3839 47.7308 13.8723 13.7978 0.0927 43.3284 14.2231 3.8489 29.5183 6.6144 20.5609 3.9457 162.2869 41.6850 39.6047 13.9935 0.6301 16.7674 40.0818 0.8672 24.9468 4.9357 3.5340 6.3881 0.6141 13.5311 5.7642 2.2891 2.3414 12.3213 0.3678
temp: 298.150 k
press: 1.00000 atm
elementType: 6 6 6 6 6 6 1 1 1 1 1 1 1 1 6 1 6 1 46 17 17 6 7 1 6 1 1 1 8 6 1 1 1
symmnumber: 1
zpe: 687602.5 jmol-1
zpe.correction: 0.261894 hartree
zpe.thermalcorrener: 0.283328 hartree
zpe.thermalcorrenthalpy: 0.284272 hartree
zpe.thermalcorrgfe: 0.206656 hartree
zpe.sumelectzpe: -1605.461231 hartree
zpe.sumelectthermal: -1605.439797 hartree
zpe.sumelectthermalent: -1605.438853 hartree
zpe.sumelectthermalfe: -1605.516469 hartree
dipole: 3.7149 1.5265 0.2042
dipole: 4.0215
quadrupole: -69.5705 -135.8384 -121.5325
quadrupole: 3.6511 6.3164 -4.4607
quadrupole: 39.4099 -26.8579 -12.5520 3.6511 6.3164 -4.4607
hfenergy: -1605.7231248 hartree
pointgroup: C01 [X(C11H17Cl2N1O1Pd1)]
dipole: 1.3600597 -0.7555615 -0.2875526 debye
polarizability: 233.6330543|-10.6063895|195.7103475|-9.3081601|20.9236856|134.9369142 unknown
InChI: InChI=1S/C9H14O.C2H3N.2ClH.Pd/c1-4-6-8-9(10-3)7-5-2;1-2-3;;;/h4-5,7H,1-2,6,8H2,3H3;1H3;2*1H;/q;;;;+2/p-2
charge 0 multiplicity 1
33 atoms
C  -3.4579311 2.80574012 0.95374874
C  -0.63342059 -0.10747146 1.09122399
C  -3.54708802 -0.18042856 -0.23676575
C  -0.63715251 0.58876746 -0.10619576
C  -2.79803249 0.48667353 -1.35336799
C  -1.30718405 0.09184243 -1.3528177
H  -2.41287554 2.56651593 0.73984798
H  -1.05626102 -1.11636365 1.13007351
H  -0.36504662 1.65020737 -0.06799207
H  -2.93765301 1.57423707 -1.3076042
H  -3.69843881 3.85218503 1.15466952
H  -3.23485385 0.12856687 -2.30022584
H  -0.81333411 0.51174897 -2.24145456
H  -1.22934418 -1.00270171 -1.39987059
C  -4.40570665 1.85774821 0.9977055
H  -5.41828103 2.16530476 1.28860532
C  -4.25007072 0.41778983 0.75282411
H  -4.824984 -0.22627812 1.42488629
Pd 1.33906283 -0.32744862 0.2550057
Cl 1.9775408 1.72804884 1.06839173
Cl 0.74867175 -2.43521718 -0.46504457
C  4.40228627 -1.11297381 -0.19058244
N  3.2990118 -0.81941149 -0.03491226
H  -0.41496713 0.41164425 2.02838424
C  5.79337186 -1.48369712 -0.38647375
H  5.85224876 -2.42799097 -0.94352002
H  6.31122408 -0.69631232 -0.94994326
H  6.2832516 -1.60776122 0.58841382
O  -3.43757854 -1.52384798 -0.36727239
C  -3.95207309 -2.36327135 0.62842831
H  -3.66563576 -3.38905937 0.36809058
H  -3.53365891 -2.10697222 1.61823755
H  -5.05249802 -2.2989425 0.68824125
