program: Gaussian 16
title: Title Card Required
version: ES64L-G16RevC.01
method: RMN15
basis: def2SVP
operation: Freq
keyword: #N
keyword: Geom=AllCheck
keyword: Guess=TCheck
keyword: SCRF=Check
keyword: GenChk
keyword: RMN15/def2SVPFreq
converged: YES YES NO NO
title: Mulliken charges:
elementType: C C C C C C H H H H H H H H C H C H Pd Cl Cl C N C H H H S H S H
charge: 0.187186 -0.234293 -0.196611 -0.047154 0.124899 0.039173 0.033082 0.040218 0.024139 0.042869 0.021406 0.036924 0.067246 0.035921 -0.043187 0.050957 0.062546 -0.000445 -0.125739 -0.344750 -0.360056 -0.286716 0.199459 0.086794 0.078380 0.076054 0.075210 -0.011415 0.093459 0.180957 0.093488
chargesum: -0.00000
title: Mulliken charges with hydrogens summed into heavy atoms:
elementType: C C C C C C C C Pd Cl Cl C N C S S
charge: 0.241675 -0.194075 -0.196611 -0.023015 0.204692 0.142340 0.007769 0.062101 -0.125739 -0.344750 -0.360056 -0.286716 0.199459 0.316437 0.082045 0.274445
chargesum: 0.00000
1716.lowfreq: -2.9608 -1.2705 -0.0012 0.0018 0.0026 5.1371 19.9972 24.2536 26.4636
frequency: 19.9755 24.2402 26.4586 30.2180 51.6382 61.4600 84.9885 98.7834 115.6996 127.8462 147.5875 169.1883 179.7966 200.6323 209.4770 223.3147 245.2575 249.2502 284.7761 295.1265 306.3353 322.3982 360.0551 362.7195 371.3772 381.2241 424.1357 431.2358 437.3619 441.9868 555.6235 621.3248 699.7942 711.5626 746.2326 790.2872 806.2054 825.6242 866.7937 893.1141 939.8069 966.6524 972.2084 978.0585 1000.5412 1023.2577 1025.3014 1026.3198 1039.7172 1069.3407 1091.9031 1117.1009 1133.7155 1181.0540 1197.1326 1205.5648 1234.5139 1258.5144 1270.7558 1283.1185 1301.3620 1358.2266 1367.1261 1371.0427 1406.3630 1420.9387 1421.4399 1445.8121 1459.6231 1486.9235 1631.9374 2461.0080 2682.1699 2741.7709 3078.4516 3081.2696 3086.6295 3098.4499 3099.3475 3126.1795 3153.8500 3161.8190 3196.5241 3202.3256 3207.5717 3208.8361 3214.0282
redmass: 1.0564 8.5513 4.4457 4.6217 8.2495 5.9591 7.1753 10.7012 8.0968 6.1728 5.9416 10.7847 4.7359 6.2515 4.6776 4.9973 7.6433 3.7640 4.8396 4.3560 3.3494 3.7161 1.8417 2.1317 3.0256 2.0038 3.4827 1.8981 3.7199 4.3235 3.3652 4.0958 3.1425 2.2684 3.3734 3.0528 2.0408 2.2365 1.4182 1.6662 1.1945 1.7486 2.2151 3.6866 1.5415 1.3191 1.4744 1.4724 1.7023 2.4827 1.4745 1.3137 1.7782 1.5126 1.2601 1.4709 1.1492 1.2198 1.1765 1.3460 1.3295 1.4304 1.6959 1.3120 1.1057 1.0363 1.0365 1.2552 1.4345 2.1016 6.2655 12.6126 1.0375 1.0381 1.0735 1.0626 1.0740 1.0855 1.0356 1.0628 1.1057 1.0998 1.0870 1.1077 1.1050 1.1053 1.0940
irintensity: 0.4491 3.6791 8.0154 5.8595 3.8846 3.9702 5.9695 2.9613 0.3963 0.9159 7.0467 2.9261 1.6989 1.1555 3.7775 0.7170 1.5926 0.3139 17.8779 5.9132 16.5914 23.8214 5.6537 30.4211 20.8551 14.6620 20.4990 87.8759 15.8161 5.1017 48.9160 105.7169 86.7427 71.2192 110.0839 22.7988 41.7894 21.6503 24.7574 31.7191 11.6841 20.9299 12.8221 0.4607 18.6686 34.2651 5.2014 6.5720 34.0906 47.1000 13.2756 31.7181 35.4664 25.0931 24.4998 81.2345 13.7878 13.2241 10.6014 14.1259 18.3029 20.4400 3.7198 0.2336 3.2615 11.8115 12.0581 18.7905 64.6078 70.5366 305.8152 2.4903 44.3949 5.8172 27.8597 2.6820 1.1162 16.7091 1.3652 3.5106 28.3259 4.9615 3.4417 5.3089 0.2671 0.3439 7.6718
temp: 298.150 k
press: 1.00000 atm
elementType: 6 6 6 6 6 6 1 1 1 1 1 1 1 1 6 1 6 1 46 17 17 6 7 6 1 1 1 16 1 16 1
symmnumber: 1
zpe: 602240.3 jmol-1
zpe.correction: 0.229381 hartree
zpe.thermalcorrener: 0.250522 hartree
zpe.thermalcorrenthalpy: 0.251466 hartree
zpe.thermalcorrgfe: 0.175227 hartree
zpe.sumelectzpe: -2287.008559 hartree
zpe.sumelectthermal: -2286.987418 hartree
zpe.sumelectthermalent: -2286.986474 hartree
zpe.sumelectthermalfe: -2287.062713 hartree
dipole: 7.7550 -3.1055 -2.9309
dipole: 8.8529
quadrupole: -58.9963 -134.2298 -152.2727
quadrupole: 0.4371 6.2725 4.4469
quadrupole: 56.1699 -19.0635 -37.1064 0.4371 6.2725 4.4469
hfenergy: -2287.2379397 hartree
pointgroup: C01 [X(C10H15Cl2N1Pd1S2)]
dipole: 3.0510327 -1.22181 -1.1530911 debye
polarizability: 385.5058677|-31.4180476|216.8436316|-16.4086641|-0.0476145|164.58329 unknown
InChI: InChI=1S/C8H12S2.C2H3N.2ClH.Pd/c9-7-3-1-4-8(10)6-2-5-7;1-2-3;;;/h1,3,6,8-10H,2,4-5H2;1H3;2*1H;/q;;;;+2/p-2
charge 0 multiplicity 1
31 atoms
C  2.62001944 1.98653974 0.53964184
C  1.23390697 1.57671384 -0.03580134
C  3.71420315 -1.03124582 0.13167344
C  0.61214249 0.39119333 0.69202569
C  2.71195616 -1.10382801 1.18696
C  1.26341926 -0.95167849 0.48930038
H  2.69093218 1.65449853 1.58932279
H  1.32838078 1.32978666 -1.10699784
H  0.53374927 0.62497157 1.76784135
H  2.81817316 -0.30384833 1.92911477
H  2.70807325 3.08083061 0.54295841
H  2.75560464 -2.07552584 1.69646562
H  0.641209 -1.71808735 0.97861978
H  1.33217265 -1.19815868 -0.5831833
C  3.70807442 1.43709396 -0.31582562
H  4.2049936 2.17809406 -0.95351521
C  4.15396479 0.16027948 -0.51974656
H  4.91769163 0.030836 -1.29215769
Pd -1.28034729 -0.03729262 0.13140028
Cl -1.66483357 -0.62150461 2.34532441
Cl -0.73168228 0.34355132 -2.12888411
C  -4.36690503 -0.75248751 -0.64459184
N  -3.26848586 -0.50726435 -0.39121961
C  -5.75402039 -1.06140793 -0.95685614
H  -6.18054115 -1.69970806 -0.17177702
H  -6.33888252 -0.13406554 -1.01857792
H  -5.81553388 -1.58591684 -1.91952151
S  0.13650561 3.02468069 0.03496885
H  -0.66857381 2.54993556 -0.93620824
S  4.2669669 -2.5451171 -0.41522602
H  4.96745445 -2.12649828 -1.48258964
