program: Gaussian 16
title: Title Card Required
version: ES64L-G16RevA.03
frameworkgroup: C1[X(C14H25Cl2N3Pd)]
method: RMN15
basis: def2SVP
operation: Freq
keyword: #N
keyword: Geom=AllCheck
keyword: Guess=TCheck
keyword: SCRF=Check
keyword: GenChk
keyword: RMN15/def2SVP
keyword: Freq
converged: YES YES NO NO
title: Mulliken charges:
elementType: C C C C C C H H H H H H H H C H C H Pd Cl Cl C N N C H H H C H H H N C H H H C H H H C H H H
charge: 0.094048 0.065253 -0.018399 -0.132997 0.070512 0.104016 -0.011120 -0.006816 -0.001054 0.017885 0.050801 0.034226 0.023750 0.001768 0.014090 0.012391 -0.051826 0.021971 -0.097170 -0.334688 -0.395235 -0.292833 0.196471 -0.175163 0.091478 0.080836 0.039621 0.053010 0.090103 0.051177 0.073361 0.069783 -0.337368 0.118795 0.022222 -0.020478 0.009345 0.126464 -0.020515 0.014620 0.038065 0.087163 0.071748 0.078503 0.072186
chargesum: -0.00000
title: Mulliken charges with hydrogens summed into heavy atoms:
elementType: C C C C C C C C Pd Cl Cl C N N C C N C C C
charge: 0.082928 0.109238 -0.018399 -0.134050 0.122622 0.129534 0.026481 -0.029855 -0.097170 -0.334688 -0.395235 -0.292833 0.196471 -0.175163 0.264945 0.284424 -0.337368 0.129884 0.158634 0.309600
chargesum: 0.00000
1716.lowfreq: -3.1554 -0.0016 -0.0012 0.0017 3.3918 4.9641 20.9287 26.1642 27.3538
frequency: 20.9152 26.1585 27.3503 38.1848 56.1858 69.4949 89.7531 98.9038 101.4517 116.8263 120.1413 127.5389 158.8048 164.1792 181.4312 186.9556 201.7750 224.9078 230.2833 232.8425 243.6112 255.0357 265.3346 278.8631 298.8725 314.1735 329.9618 349.0413 373.0072 387.4596 407.5261 423.7132 424.8280 430.1774 437.5061 451.9377 479.0403 485.0666 500.6075 541.4272 615.4852 667.2291 700.1904 729.3804 757.8318 812.7207 863.6893 883.1760 934.1210 940.3772 971.9700 975.5316 988.2747 1001.6879 1019.7068 1025.1484 1026.5792 1046.2150 1054.5786 1067.2451 1077.2791 1077.7308 1090.4005 1104.0695 1120.1211 1147.6098 1152.6215 1161.0830 1175.4497 1183.3846 1204.0110 1206.4141 1226.3277 1230.7825 1266.7693 1289.5871 1294.1719 1308.6749 1317.9031 1327.1278 1366.4369 1371.1131 1376.7674 1386.0983 1396.6863 1407.8785 1416.9719 1421.3882 1421.6623 1422.5018 1428.0906 1434.1444 1442.4145 1444.1766 1447.1154 1450.0747 1454.4704 1459.6517 1462.3030 1475.3654 1479.1544 1696.9422 1720.1232 2456.2671 2862.7842 2949.2667 2960.2992 3053.7967 3083.4672 3084.6707 3095.0273 3098.6170 3106.2543 3112.5072 3126.3388 3128.2616 3144.3156 3165.4033 3168.5370 3174.2850 3180.9934 3183.9561 3189.6718 3206.2646 3207.3671 3209.1685 3234.0963 3241.3556 3245.1488
redmass: 1.0335 3.9325 4.1258 8.5624 4.2820 2.7377 6.3628 2.6605 6.7629 3.9655 1.7162 4.1262 6.1455 4.2671 3.7107 3.3913 4.6956 1.7025 2.3819 4.5333 1.5498 4.0574 2.6098 2.4559 1.7253 2.8058 4.2737 3.3454 3.5380 2.6944 2.9969 3.3538 2.8274 2.6742 4.3063 2.5273 2.1177 2.1315 2.3717 2.8522 3.7061 3.6682 2.4432 1.9304 2.0919 2.2775 2.0309 2.5605 2.7021 2.2914 2.3279 3.7981 1.8520 1.4902 2.1763 1.4714 1.4729 1.6308 1.4107 1.4834 1.4821 1.2752 1.5281 1.3541 1.6331 1.4865 1.3948 1.2595 1.9328 1.6177 1.5503 1.6698 1.7115 1.3980 1.7111 1.8799 1.8440 2.3485 1.4059 1.3781 1.6588 1.3118 1.3966 1.2785 1.2303 1.3394 1.3091 1.0368 1.0801 1.0366 1.1456 1.1602 1.1175 1.0852 1.1693 1.0582 1.0827 1.1053 1.0605 1.1284 1.1272 7.8739 7.0275 12.6060 1.0767 1.0596 1.0592 1.0439 1.0370 1.0692 1.0677 1.0356 1.0691 1.0781 1.0752 1.0774 1.1008 1.1013 1.0991 1.1040 1.0960 1.1066 1.1055 1.1050 1.1052 1.0874 1.0943 1.1029 1.1033
irintensity: 0.2336 6.3974 8.2638 0.2904 0.4960 0.3469 0.4514 1.5278 5.9994 2.6549 5.9161 0.6337 6.6916 1.1937 0.6420 0.7102 1.4112 0.6863 0.5985 5.9412 0.8000 8.2372 7.6912 1.7745 0.4221 5.1194 36.3169 14.1834 1.3283 6.4941 9.1505 0.5106 0.3211 1.8901 0.3661 1.2755 0.2653 1.2075 0.6020 1.7640 0.6694 4.6472 11.9400 9.0725 12.7633 0.9186 2.7320 10.1791 9.5413 21.6711 15.0927 0.7363 7.6645 2.0799 1.0538 4.5055 4.8582 7.9428 5.4884 3.3932 10.6958 0.6540 27.4892 7.5216 13.9113 4.9671 12.3609 6.5755 8.5679 13.5048 19.7333 13.9809 3.2839 10.4681 6.1655 6.5274 26.1791 28.6182 1.4144 7.9500 23.6161 0.1457 1.4249 5.6891 5.2531 7.9805 27.7674 11.7176 3.3409 11.5493 4.3610 4.9137 8.4653 7.4509 14.3094 3.1046 3.1573 49.6181 12.6635 21.7284 13.8897 5.8418 229.1329 2.4763 50.2656 64.4794 78.3237 68.2480 26.1964 13.0055 7.4284 2.0969 18.1495 20.4543 34.0562 28.5408 13.0673 3.5364 13.8565 27.3780 7.8470 4.4366 5.1756 0.0654 0.2562 0.4759 9.3863 4.8660 1.7466
temp: 298.150 k
press: 1.00000 atm
elementType: 6 6 6 6 6 6 1 1 1 1 1 1 1 1 6 1 6 1 46 17 17 6 7 7 6 1 1 1 6 1 1 1 7 6 1 1 1 6 1 1 1 6 1 1 1
symmnumber: 1
zpe: 994357.5 jmol-1
zpe.correction: 0.378731 hartree
zpe.thermalcorrener: 0.403960 hartree
zpe.thermalcorrenthalpy: 0.404904 hartree
zpe.thermalcorrgfe: 0.321671 hartree
zpe.sumelectzpe: -1758.401479 hartree
zpe.sumelectthermal: -1758.376251 hartree
zpe.sumelectthermalent: -1758.375306 hartree
zpe.sumelectthermalfe: -1758.458539 hartree
dipole: -5.8533 7.1382 -1.6068
dipole: 9.3700
quadrupole: -97.6621 -141.5836 -149.3480
quadrupole: -3.0080 -10.6294 6.2795
quadrupole: 31.8692 -12.0524 -19.8168 -3.0080 -10.6294 6.2795
hfenergy: -1758.7802102 hartree
pointgroup: C01 [X(C14H25Cl2N3Pd1)]
dipole: -2.1977785 2.8710956 -0.7186863 debye
polarizability: 276.5079033|1.2028243|256.8850425|-0.5888714|-3.8947986|172.693819 unknown
InChI: InChI=1S/C12H22N2.C2H3N.2ClH.Pd/c1-13(2)11-7-5-6-8-12(10-9-11)14(3)4;1-2-3;;;/h5,9-11H,6-8H2,1-4H3;1H3;2*1H;/q;;;;+2/p-2
charge 0 multiplicity 1
45 atoms
C  -2.64563376 -1.27391954 -0.35001334
C  -1.22586353 -0.65223301 -0.4785653
C  -2.77937525 1.68998818 0.31275775
C  -0.48745288 -0.4739259 0.83797752
C  -2.45592627 1.08086172 1.64364911
C  -0.96830479 0.65741251 1.76093863
H  -2.86190806 -1.39186504 0.74449388
H  -1.25736598 0.30332883 -1.02599836
H  -0.51475026 -1.43043873 1.38348186
H  -3.14152693 0.24336305 1.82275754
H  -0.64336244 -1.31697926 -1.13412872
H  -2.67365238 1.83017468 2.42380072
H  -0.79799138 0.36651053 2.80865797
H  -0.35332483 1.55094985 1.58494608
C  -3.66939089 -0.31415641 -0.88253337
H  -4.40955547 -0.68581158 -1.59654948
C  -3.69796371 1.00612571 -0.61126261
H  -4.42926323 1.64051685 -1.12030056
Pd 1.42691017 -0.16986096 0.31054835
Cl 1.85550433 -2.31663983 1.06620082
Cl 0.8402103 1.95367392 -0.66817783
C  4.56628709 0.15185382 -0.59626376
N  3.45719041 0.08640885 -0.28386023
N  -2.2883936 2.85777747 -0.017769
C  -1.509567 3.71390838 0.87458627
H  -0.44201875 3.56284429 0.63674097
H  -1.80042254 4.75518013 0.6780789
H  -1.69989057 3.47414426 1.92447318
C  -2.2904849 3.35219045 -1.39281154
H  -2.83067256 4.30777153 -1.45501345
H  -1.2332999 3.48558381 -1.67103363
H  -2.7294275 2.61397682 -2.07013881
N  -2.7166048 -2.59843008 -0.95592993
C  -4.03559845 -3.18967985 -0.87368851
H  -4.0034434 -4.21014983 -1.2815881
H  -4.40038666 -3.26167303 0.17772478
H  -4.7863547 -2.63744715 -1.45631691
C  -1.76904348 -3.49857668 -0.31213763
H  -2.04661164 -3.68007755 0.75174181
H  -1.76713806 -4.46724161 -0.83226685
H  -0.74192257 -3.10818481 -0.31055678
C  5.96656101 0.21997564 -0.98721638
H  6.51627412 0.88268581 -0.30571589
H  6.41381051 -0.78212385 -0.94658176
H  6.05445718 0.60953762 -2.01007741
