program: Gaussian 16
title: Title Card Required
version: ES64L-G16RevA.03
frameworkgroup: C1[X(C12H20Cl2N2Pd)]
method: RMN15
basis: def2SVP
operation: Freq
keyword: #N
keyword: Geom=AllCheck
keyword: Guess=TCheck
keyword: SCRF=Check
keyword: GenChk
keyword: RMN15/def2SVP
keyword: Freq
converged: YES YES NO NO
title: Mulliken charges:
elementType: C C C C C C H H H H H H H C C H Pd Cl Cl C N H H H C H H H C H H H N C H H H
charge: 0.016553 0.128784 0.010249 -0.137257 -0.041387 0.163391 0.033849 0.065324 0.063288 -0.008693 -0.012923 0.055225 0.005937 -0.069463 -0.006059 0.013423 -0.140639 -0.270581 -0.287221 -0.249315 0.184964 0.018327 0.081530 -0.001815 0.124591 0.013106 0.022485 0.015645 0.083480 0.088440 0.088975 0.089919 -0.312960 0.119003 0.009517 0.013038 0.029270
chargesum: -0.00000
title: Mulliken charges with hydrogens summed into heavy atoms:
elementType: C C C C C C C C Pd Cl Cl C N C C N C
charge: 0.068729 0.275637 0.010249 -0.073968 -0.063003 0.224553 -0.071279 0.007364 -0.140639 -0.270581 -0.287221 -0.249315 0.184964 0.175827 0.350814 -0.312960 0.170829
chargesum: 0.00000
1716.lowfreq: -3.7427 -2.5989 -0.0018 -0.0013 0.0011 3.6797 14.5779 16.5475 30.6714
frequency: 14.5315 16.5131 30.6626 34.9999 41.9822 57.4999 73.6101 93.1147 97.4998 109.3130 133.7721 151.6005 161.8190 165.2881 184.1259 187.3581 200.8346 227.3507 234.6817 270.7477 275.2016 287.9611 300.1257 326.9880 352.4319 382.8205 395.7201 412.5307 421.9678 434.2252 447.7710 449.5626 485.0305 527.7620 563.1848 667.0754 700.1788 732.8082 743.6646 823.3949 837.3579 856.6916 875.7454 920.6019 954.8751 977.0342 984.3053 996.4955 1020.8911 1023.3923 1024.5013 1026.2165 1032.8975 1062.1873 1073.8484 1087.7541 1101.9111 1126.7702 1140.7698 1183.1036 1214.3384 1264.3174 1279.6149 1288.1881 1314.2716 1322.2693 1335.5935 1369.4529 1389.6071 1403.5496 1404.9207 1413.9743 1415.8421 1416.8554 1421.1322 1426.3849 1434.1319 1445.7017 1457.8603 1465.1007 1491.0749 1595.7067 1701.0253 1734.5855 2475.3760 3006.1669 3016.7717 3065.6164 3100.9968 3103.5109 3116.1053 3134.4884 3157.8428 3171.7777 3175.4750 3175.5207 3180.0357 3185.5652 3211.9467 3213.6373 3214.9512 3220.9932 3284.3196 3293.8374 3313.7084
redmass: 1.1059 3.1993 4.0230 6.6669 5.1760 3.6630 5.2312 3.2504 3.2321 11.9028 3.3499 7.3764 4.5443 4.1094 3.8546 1.3441 3.5982 3.9410 3.5250 1.9443 8.2056 1.7244 2.0144 28.0205 3.4011 12.0724 3.3023 2.2195 3.8598 2.6763 2.7486 3.7122 2.4427 2.7654 2.0951 1.9742 2.1500 1.3969 1.3214 2.6091 1.6440 1.7773 1.6701 1.6445 1.2999 1.5857 2.4227 1.5314 1.3202 1.4892 1.4785 1.1575 1.7145 1.3492 1.3550 1.7459 1.2467 1.6118 1.4133 1.4776 1.3824 1.6317 1.2874 1.3613 1.9075 1.5612 2.6793 1.3112 1.1672 1.2541 1.2233 1.4112 1.0359 1.0365 1.7164 1.1904 1.0580 1.0928 1.0904 1.1678 1.3662 3.9751 5.8748 5.4699 12.6421 1.0505 1.0536 1.0831 1.0353 1.0645 1.0870 1.0859 1.1027 1.0694 1.0988 1.0621 1.1028 1.0849 1.1051 1.1056 1.0894 1.0634 1.1177 1.1199 1.1156
irintensity: 0.2887 1.7717 3.5769 2.9060 5.3412 1.4188 0.6440 0.3122 0.3441 1.0104 1.1321 4.5994 4.2405 0.6445 1.4211 1.0574 2.3329 2.9899 4.9184 2.7989 2.9024 1.7409 0.8449 0.7038 5.1472 48.4395 4.2005 0.8847 0.7783 4.6317 0.6090 0.2498 8.9824 3.1976 13.7454 3.8122 1.5233 1.2754 6.0990 1.7344 12.1569 27.0117 1.9336 1.3747 39.5239 10.4691 5.3101 12.7316 5.7695 8.0948 5.8131 7.6497 16.6155 2.8901 9.1181 12.7129 3.3089 9.8962 19.6131 20.1842 1.9699 6.5452 5.0987 1.1485 30.8874 4.7182 24.8472 0.3211 10.0331 16.3523 7.1809 51.5639 13.8107 14.1667 21.3051 8.1234 10.5229 8.2458 8.0548 2.3002 88.4079 11.6952 139.5199 8.8986 39.9901 60.9539 94.3906 16.2151 0.6054 6.4462 26.0812 22.5337 3.4563 10.5237 7.9403 0.3862 26.6696 7.5235 2.3310 2.2479 1.0377 4.1320 7.2501 0.3609 4.0529
temp: 298.150 k
press: 1.00000 atm
elementType: 6 6 6 6 6 6 1 1 1 1 1 1 1 6 6 1 46 17 17 6 7 1 1 1 6 1 1 1 6 1 1 1 7 6 1 1 1
symmnumber: 1
zpe: 791624.0 jmol-1
zpe.correction: 0.301514 hartree
zpe.thermalcorrener: 0.324472 hartree
zpe.thermalcorrenthalpy: 0.325416 hartree
zpe.thermalcorrgfe: 0.245052 hartree
zpe.sumelectzpe: -1624.791319 hartree
zpe.sumelectthermal: -1624.768361 hartree
zpe.sumelectthermalent: -1624.767417 hartree
zpe.sumelectthermalfe: -1624.847781 hartree
dipole: 1.5652 2.6187 -2.1766
dipole: 3.7477
quadrupole: -84.1578 -125.1849 -138.9063
quadrupole: 19.7508 -6.3062 -11.6744
quadrupole: 31.9252 -9.1019 -22.8233 19.7508 -6.3062 -11.6744
hfenergy: -1625.0928329 hartree
pointgroup: C01 [X(C12H20Cl2N2Pd1)]
dipole: 0.6156244 1.0312541 -0.855287 debye
polarizability: 242.138772|19.7874614|187.0389431|-13.6625556|9.3640848|173.9605886 unknown
InChI: InChI=1S/C10H17N.C2H3N.2ClH.Pd/c1-6-8-10(7-2)9(3)11(4)5;1-2-3;;;/h6-7,10H,1-3,8H2,4-5H3;1H3;2*1H;/q;;;;+2/p-2
charge 0 multiplicity 1
37 atoms
C  -3.64383774 -1.18785591 1.63436345
C  0.42003424 -1.85812978 1.11136565
C  -2.98026135 0.76555402 -0.46267309
C  -0.42078318 -0.90066923 0.57259747
C  -2.04233101 1.72622279 -0.29723144
C  -1.12092228 -0.99149175 -0.75880812
H  -3.65914715 -0.12618635 1.89914702
H  0.64731373 -2.77509034 0.56076288
H  -0.75817886 -0.10204399 1.24222677
H  -0.98159022 1.49120921 -0.21762559
H  -2.30313108 2.78088795 -0.21602236
H  -0.67751139 -0.27651843 -1.46991452
H  -0.9500944 -1.98808106 -1.19142377
C  -3.21258459 -1.59559212 0.43792389
C  -2.62959016 -0.7061126 -0.63908036
H  -3.06003869 -1.024567 -1.60542356
Pd 1.6904833 -0.34377472 0.25785361
Cl 1.44855673 1.02613628 2.08862564
Cl 1.98577166 -1.73148063 -1.56021279
C  4.20798458 1.37792992 -0.6815472
N  3.29465476 0.76022557 -0.34701905
H  -3.99799425 -1.90168427 2.38187206
H  0.6878205 -1.80556717 2.17005442
H  -3.20320036 -2.66797335 0.20553059
C  -5.25908881 0.22161041 -1.23050131
H  -5.10096557 0.28784005 -2.3253428
H  -5.1916351 -0.83424495 -0.93155406
H  -6.2885312 0.5448211 -1.02289759
C  5.35993583 2.15672474 -1.1026331
H  6.28250965 1.62289768 -0.83855029
H  5.33045007 2.30568609 -2.18998414
H  5.3523459 3.13343754 -0.60100131
N  -4.34803354 1.04651389 -0.46543399
C  -4.74543963 2.41842454 -0.27156335
H  -4.43800776 3.08411784 -1.10367286
H  -5.83818517 2.47273846 -0.17320151
H  -4.29750247 2.81812856 0.6516827
