program: Gaussian 16
title: Title Card Required
version: ES64L-G16RevC.01
frameworkgroup: C1[X(C12H20Cl2N2Pd)]
method: RMN15
basis: def2SVP
operation: Freq
keyword: #N
keyword: Geom=AllCheck
keyword: Guess=TCheck
keyword: SCRF=Check
keyword: GenChk
keyword: RMN15/def2SVP
keyword: Freq
converged: YES YES NO NO
title: Mulliken charges:
elementType: C C C C C C H H H H H H H C H C Pd Cl Cl C N H H C H H H N C H H H C H H H H
charge: 0.135583 -0.028142 -0.138139 -0.077611 0.074549 0.056546 0.067398 0.012515 0.000484 0.001534 0.000242 0.006232 0.016701 -0.122616 0.076347 0.191785 -0.150678 -0.273592 -0.256098 -0.253171 0.188544 -0.022862 0.010958 0.084385 0.089729 0.090277 0.089386 -0.321782 0.110534 0.034115 0.040313 0.011804 0.126527 0.013871 0.024040 0.012926 0.077368
chargesum: -0.00000
title: Mulliken charges with hydrogens summed into heavy atoms:
elementType: C C C C C C C C Pd Cl Cl C N C N C C
charge: 0.280349 -0.004670 -0.161001 -0.077127 0.076325 0.079478 -0.046269 0.191785 -0.150678 -0.273592 -0.256098 -0.253171 0.188544 0.353777 -0.321782 0.196765 0.177364
chargesum: 0.00000
1716.lowfreq: -4.6583 0.0015 0.0021 0.0032 2.7285 3.2704 11.8063 25.9492 30.9400
frequency: 11.7665 25.9474 30.9390 35.8797 46.5757 64.6731 70.6810 76.5511 108.3537 108.9849 114.3780 151.9534 157.8411 162.6289 189.2490 205.9129 209.0315 220.7281 240.8579 251.3361 273.8867 280.6367 294.1785 325.1265 336.6000 361.6037 382.9686 420.9128 422.4415 440.5665 448.2798 463.4782 482.7651 544.1915 561.2960 605.8723 621.1431 755.0482 796.9229 802.2124 847.3006 939.6186 943.9497 954.3245 978.3468 983.3911 991.4808 1002.7653 1020.6767 1022.9359 1024.3505 1039.5570 1073.4738 1077.8913 1099.1191 1110.3483 1119.1231 1133.8113 1148.3630 1194.2626 1257.3059 1262.3771 1280.9399 1293.2440 1295.9891 1350.5688 1365.2691 1369.2205 1389.0790 1409.7752 1415.2207 1415.6574 1416.4423 1421.6033 1432.1986 1435.0544 1440.0912 1454.2371 1455.9545 1464.0994 1486.8584 1595.2833 1707.6005 1738.6374 2474.2859 3003.1202 3015.5579 3058.5757 3067.3745 3095.5768 3101.0459 3117.0275 3123.6356 3130.2993 3163.1872 3173.6035 3176.0464 3185.9065 3188.9527 3195.9091 3211.9508 3213.8879 3221.4955 3279.0962 3305.4708
redmass: 1.0135 4.4942 4.9490 4.7891 6.0147 3.4039 5.1389 3.1328 6.5427 4.5411 4.5542 5.8479 8.3316 5.1590 3.2987 2.9807 2.6044 3.8669 2.2276 1.5452 5.9797 2.3590 1.2743 30.5677 3.0325 2.6331 16.4594 3.7683 3.8501 2.8238 3.8458 3.6119 3.3642 2.6038 1.2243 2.4222 2.3077 1.5884 1.6558 1.3211 1.6668 2.4935 1.3166 2.6507 1.4985 2.8138 1.5383 1.3687 1.3511 1.4888 1.4811 1.1603 1.3577 1.3875 1.2477 1.7659 1.9036 1.4219 1.3965 1.5944 1.3400 1.4685 1.1417 1.8295 1.3203 1.8872 1.8755 1.3126 1.7426 1.2142 1.2949 1.0359 1.0365 1.4229 1.1048 1.1581 1.0830 1.1906 1.1241 1.1047 1.2384 4.4101 7.4442 5.3987 12.6419 1.0511 1.0487 1.0646 1.0674 1.0976 1.0353 1.0857 1.0913 1.0995 1.1039 1.1036 1.0656 1.0577 1.0886 1.0902 1.1051 1.1056 1.0875 1.1166 1.1186
irintensity: 0.0162 4.2858 3.1051 2.7953 0.9843 2.4853 0.6751 0.3586 2.0061 1.2743 1.6855 3.6446 1.0903 2.8420 4.0007 0.6761 0.9279 0.6149 10.1400 1.6667 1.3916 1.6199 0.1218 1.2150 7.1193 0.9853 49.7416 3.8801 0.9249 0.0735 0.3613 1.4229 3.1938 0.3735 2.2313 29.6397 7.5740 10.5347 2.0001 18.3836 16.1177 7.1402 34.4109 14.4123 1.7517 11.3147 18.7406 12.7996 15.3864 6.8808 4.8940 1.6710 7.1768 0.6215 5.4445 1.3537 27.5483 23.2444 10.6487 0.2550 0.6941 0.9787 0.5828 12.7273 11.0272 41.5821 22.8381 0.2945 5.9679 8.5431 2.0202 13.9962 13.5887 40.5153 4.1312 19.6584 12.4525 2.8734 5.6864 2.2653 89.8889 64.9698 77.1959 26.0713 41.6626 50.2148 55.6872 14.4078 29.6705 3.5396 0.7763 31.9381 11.9336 18.5243 20.7037 23.2312 13.6196 0.7472 10.7665 0.0983 2.5021 2.3646 11.1020 17.5635 1.5287
temp: 298.150 k
press: 1.00000 atm
elementType: 6 6 6 6 6 6 1 1 1 1 1 1 1 6 1 6 46 17 17 6 7 1 1 6 1 1 1 7 6 1 1 1 6 1 1 1 1
symmnumber: 1
zpe: 792311.9 jmol-1
zpe.correction: 0.301776 hartree
zpe.thermalcorrener: 0.324753 hartree
zpe.thermalcorrenthalpy: 0.325697 hartree
zpe.thermalcorrgfe: 0.245594 hartree
zpe.sumelectzpe: -1624.796240 hartree
zpe.sumelectthermal: -1624.773263 hartree
zpe.sumelectthermalent: -1624.772319 hartree
zpe.sumelectthermalfe: -1624.852423 hartree
dipole: -4.8631 0.3210 -3.1461
dipole: 5.8009
quadrupole: -97.0938 -125.2241 -137.4889
quadrupole: 9.9198 19.9389 -1.6415
quadrupole: 22.8418 -5.2885 -17.5533 9.9198 19.9389 -1.6415
hfenergy: -1625.0980161 hartree
pointgroup: C01 [X(C12H20Cl2N2Pd1)]
dipole: 1.9132887 -0.126252 -1.2377524 debye
polarizability: 265.2639376|-4.6135865|177.2999208|-4.5889725|0.0489256|181.0730135 unknown
InChI: InChI=1S/C10H17N.C2H3N.2ClH.Pd/c1-5-7-8-9-10(6-2)11(3)4;1-2-3;;;/h5-6,9H,1-2,7-8H2,3-4H3;1H3;2*1H;/q;;;;+2/p-2
charge 0 multiplicity 1
37 atoms
C  -0.77601499 0.67254277 1.33347355
C  -5.19821018 2.30599649 0.59856556
C  -2.64886112 -1.24310782 -0.267039
C  -4.49851266 2.16025529 -0.5309531
C  -3.55115733 -0.120063 0.14982432
C  -3.63167872 0.99228575 -0.89831591
H  -1.35801042 1.29321349 0.64967103
H  -5.80103221 3.19914459 0.77899695
H  -4.542262 2.9616127 -1.27865566
H  -3.24481642 0.3052552 1.11828873
H  -4.56729216 -0.52175176 0.30859786
H  -3.98950112 0.56769607 -1.85393536
H  -2.6118375 1.34514106 -1.13696765
C  -0.68828465 -0.70196783 1.16599051
H  -0.17688418 -1.26251811 1.95787883
C  -1.38978461 -1.52893917 0.15936375
Pd 1.09783721 0.39221823 0.33427612
Cl 2.13614725 -0.06155759 2.34272501
Cl 0.0819981 0.82318908 -1.68661704
C  3.92769077 0.94531547 -1.03342317
N  2.90947716 0.72671951 -0.54017112
H  -3.08860599 -1.92324975 -1.00126747
H  -5.20097086 1.54502792 1.38433757
C  5.21131036 1.22366516 -1.65451322
H  5.35602773 2.30961854 -1.72962978
H  6.0195876 0.79349178 -1.04861244
H  5.23934644 0.78772873 -2.66185638
N  -0.72171753 -2.71243926 -0.18519609
C  0.71962913 -2.69694527 -0.35727358
H  1.0387764 -2.14366636 -1.26313351
H  1.22680279 -2.24957755 0.51159107
H  1.07782198 -3.73376085 -0.43745245
C  -1.4154592 -3.63992156 -1.04192539
H  -0.82339899 -4.56129569 -1.13096825
H  -2.39456294 -3.90179972 -0.61195918
H  -1.59089094 -3.24439358 -2.06350606
H  -0.44923621 1.11078407 2.28019495
