program: Gaussian 16
title: Title Card Required
version: ES64L-G16RevC.01
frameworkgroup: C1[X(C14H25Cl2N3Pd)]
method: RMN15
basis: def2SVP
operation: Freq
keyword: #N
keyword: Geom=AllCheck
keyword: Guess=TCheck
keyword: SCRF=Check
keyword: GenChk
keyword: RMN15/def2SVP
keyword: Freq
converged: YES YES NO NO
title: Mulliken charges:
elementType: C C C C C C H H H H H H H C C H Pd Cl Cl C N N C H H H C H H H H N C C H H H H H H H C H H H
charge: 0.020235 0.118779 -0.060681 -0.101736 0.006889 0.180975 0.005384 0.043111 0.007068 0.001274 0.001108 0.025183 0.004987 -0.105010 0.073071 -0.006976 -0.123252 -0.296353 -0.310142 -0.270916 0.200927 -0.327568 0.109823 0.000779 0.010147 0.038385 0.137012 0.030933 0.010652 -0.006946 0.003053 -0.236669 0.115420 0.110295 0.031922 0.020957 0.048029 0.052360 0.035838 0.052485 0.014908 0.085692 0.083600 0.081363 0.083603
chargesum: -0.00000
title: Mulliken charges with hydrogens summed into heavy atoms:
elementType: C C C C C C C C Pd Cl Cl C N N C C N C C C
charge: 0.040526 0.161890 -0.060681 -0.094668 0.009271 0.211145 -0.101957 0.066095 -0.123252 -0.296353 -0.310142 -0.270916 0.200927 -0.327568 0.159134 0.171651 -0.236669 0.216329 0.250978 0.334258
chargesum: 0.00000
1716.lowfreq: -1.7213 0.0013 0.0022 0.0023 4.7873 4.8884 12.7306 25.0049 30.9861
frequency: 12.6852 24.9904 30.9805 41.5641 44.4434 51.6905 58.0043 68.6938 97.0231 103.6449 114.0158 128.1959 135.6396 148.5490 157.3938 162.8922 166.2881 177.0134 194.1535 198.6831 213.8553 227.4206 244.4735 254.6093 262.8051 268.4504 300.9961 304.2042 308.6703 338.0380 351.2771 364.0288 369.2943 389.9039 418.6290 427.7762 437.7793 451.7249 462.4460 479.3909 548.8894 588.7597 645.9641 670.3276 706.4575 757.1317 781.1011 839.7592 870.2755 902.5512 904.9398 925.5596 969.0310 976.1064 981.7632 998.1737 1012.5644 1022.5144 1024.2745 1025.2537 1038.8440 1060.3929 1068.5295 1073.2508 1098.5470 1102.4699 1121.4405 1127.9375 1148.9877 1160.4265 1172.8913 1213.3910 1220.7800 1259.9238 1267.2266 1283.3883 1303.0090 1310.2588 1344.6248 1370.2616 1371.8471 1380.8171 1394.0332 1403.5718 1410.0771 1415.4436 1418.7360 1419.1255 1422.1129 1426.2136 1429.8367 1434.0256 1435.3523 1437.9174 1440.0409 1449.4642 1455.2177 1468.8478 1484.9653 1488.7838 1666.4331 1716.0292 1728.1267 2467.9904 2994.3276 3000.0871 3053.4477 3065.8815 3095.4551 3099.7561 3100.4168 3111.5269 3112.9321 3148.9209 3154.8611 3156.2645 3156.9040 3174.9838 3189.0977 3193.5036 3196.2722 3203.3049 3205.3681 3210.0067 3211.3705 3217.4297 3226.6195 3289.2605 3296.1175
redmass: 1.0250 4.0598 4.0702 6.4674 4.6545 3.6656 3.8133 3.8264 4.9592 8.4955 3.8965 4.5096 3.1242 4.3051 1.4451 6.2021 2.2471 1.9213 4.8198 2.4261 2.3758 2.4737 3.0781 4.0289 1.5729 4.3008 2.4568 2.4567 7.2217 1.8450 1.4374 15.6448 2.3090 2.5333 2.3190 4.1468 3.3163 3.9868 2.3775 2.6846 3.3536 3.8526 2.0256 2.5662 1.9270 1.5121 3.3217 1.9636 2.3724 1.4875 1.9743 1.5015 1.5045 1.7100 3.6438 1.4164 1.7018 1.8461 1.4799 1.4780 1.1504 1.4878 1.3962 1.3924 1.2604 1.2491 2.1250 1.7285 1.4170 1.5035 1.2686 1.3537 1.9199 1.5746 4.0192 1.5642 1.2699 1.3885 1.4421 1.3236 1.9179 2.5418 1.1913 1.3131 1.1961 1.2545 1.0362 1.0363 1.2569 1.2435 1.0848 1.0640 1.0839 1.0697 1.2331 1.1120 1.0838 1.0908 1.1503 1.5364 5.0995 5.8331 5.8022 12.6266 1.0494 1.0530 1.0378 1.0379 1.0636 1.0862 1.0355 1.0842 1.0896 1.1029 1.1039 1.1060 1.1058 1.0686 1.0845 1.0632 1.1057 1.0990 1.1048 1.1050 1.1054 1.0909 1.0875 1.1161 1.1165
irintensity: 0.0802 2.3285 5.6476 1.6174 5.5590 2.6444 5.1540 0.5986 3.3868 1.2311 0.2717 2.4690 1.6429 1.9967 0.2389 1.2155 0.8861 0.3128 2.0129 1.2950 1.0685 3.5123 2.1745 2.7236 0.3663 3.4349 5.5126 1.8991 2.4021 0.6001 0.5447 43.3899 0.4483 0.1788 1.9164 0.0974 11.3521 8.7078 4.2852 19.4251 2.9630 40.3747 1.0884 17.1792 6.1448 6.0462 9.2020 13.2263 1.4783 26.3352 25.8165 55.9709 26.5625 3.4824 4.1789 14.9080 14.3945 17.0127 5.5494 5.0823 21.1746 9.1957 13.8356 4.3622 4.1489 6.4370 12.5643 29.9108 16.5883 13.8864 5.3671 2.5785 4.8891 11.6279 35.2923 23.2760 4.8715 12.9404 3.9248 0.2019 3.8406 47.3720 0.1489 5.0202 0.2858 1.8140 12.5666 12.5595 5.1048 45.4019 3.8371 1.7080 5.2604 4.9743 4.6129 20.2052 10.9179 12.3919 16.2474 21.5847 364.6894 31.0279 36.2299 18.4436 56.2065 122.0248 22.7472 52.9809 2.3827 29.3157 0.0356 21.3251 23.7442 1.2120 14.8489 6.9937 7.7634 8.9725 14.8213 0.8840 7.3303 6.9984 7.1362 1.0512 1.0392 1.6123 2.4282 8.6204 4.8075
temp: 298.150 k
press: 1.00000 atm
elementType: 6 6 6 6 6 6 1 1 1 1 1 1 1 6 6 1 46 17 17 6 7 7 6 1 1 1 6 1 1 1 1 7 6 6 1 1 1 1 1 1 1 6 1 1 1
symmnumber: 1
zpe: 986437.2 jmol-1
zpe.correction: 0.375714 hartree
zpe.thermalcorrener: 0.402693 hartree
zpe.thermalcorrenthalpy: 0.403637 hartree
zpe.thermalcorrgfe: 0.315539 hartree
zpe.sumelectzpe: -1758.417886 hartree
zpe.sumelectthermal: -1758.390907 hartree
zpe.sumelectthermalent: -1758.389963 hartree
zpe.sumelectthermalfe: -1758.478061 hartree
dipole: -2.2397 1.3789 2.8918
dipole: 3.9090
quadrupole: -106.3814 -148.8058 -148.5587
quadrupole: 12.8677 -1.0486 12.9074
quadrupole: 28.2006 -14.2238 -13.9768 12.8677 -1.0486 12.9074
hfenergy: -1758.7935999 hartree
pointgroup: C01 [X(C14H25Cl2N3Pd1)]
dipole: -0.8811176 0.5428478 1.137606 debye
polarizability: 270.1649041|16.2566076|221.7578584|15.7004422|5.7253404|212.0831582 unknown
InChI: InChI=1S/C12H22N2.C2H3N.2ClH.Pd/c1-7-12(11(2)14(5)6)9-8-10-13(3)4;1-2-3;;;/h7-8,10,12H,1-2,9H2,3-6H3;1H3;2*1H;/q;;;;+2/p-2
charge 0 multiplicity 1
45 atoms
C  3.34848568 1.9793521 -0.32147135
C  0.32265522 1.52271396 0.32996816
C  2.96597398 -1.21102686 -0.97067158
C  0.55684218 0.26370533 -0.27931683
C  2.6424355 -2.42498667 -1.44466877
C  1.02640247 0.17855386 -1.71255999
H  3.09713209 1.48125264 0.61780778
H  0.00666423 2.35141121 -0.31297576
H  0.96917431 -0.51488052 0.3688317
H  2.16928382 -2.52748111 -2.42421094
H  2.80781044 -3.33902382 -0.87265311
H  0.5741774 -0.70360593 -2.19120594
H  0.69052368 1.06121171 -2.27864516
C  3.20633346 1.36607147 -1.50285077
C  2.57775549 0.02261687 -1.79308291
H  2.80095808 -0.21922321 -2.84322934
Pd -1.50297746 -0.06461444 -0.14814093
Cl -1.03876713 -1.80174182 1.32968567
Cl -1.99545604 1.60083889 -1.69302322
C  -4.61660757 -0.87528551 -0.07026803
N  -3.50798139 -0.55878443 -0.07559777
N  3.49577992 -1.01941573 0.33405465
C  3.15742189 -2.0340479 1.31239282
H  3.66944703 -3.00236021 1.1326115
H  3.4688824 -1.6857298 2.31055453
H  2.0694575 -2.2096082 1.3239963
C  4.91889952 -0.7204226 0.35219115
H  5.17511463 -0.00304603 -0.43655319
H  5.2063883 -0.28053136 1.32101419
H  5.5229064 -1.6378371 0.19349795
H  3.48724498 1.93066036 -2.40013749
N  0.44570741 1.80569821 1.62537014
C  0.90892276 0.79852565 2.56591696
C  -0.14424239 3.01220134 2.17048096
H  1.83474414 0.33631763 2.18834657
H  1.11016984 1.27690539 3.53298487
H  0.1574805 -0.00214649 2.67996415
H  -1.06421143 2.7771832 2.73140626
H  0.56185472 3.51336823 2.84914318
H  -0.40550441 3.69626843 1.35319148
H  3.7530325 2.9938724 -0.26836096
C  -6.01396629 -1.277498 -0.06669192
H  -6.1904024 -2.00925333 0.73261982
H  -6.65502682 -0.4013343 0.09751156
H  -6.27164514 -1.7317865 -1.03260538
