program: Gaussian 16
title: min nm2166_B irc ( for irc NM1549 (sub 2.17 from nm1243 for ts (from s can nm1140 freeze 1 2 at 2.2 and scan 5 6 (took nm1128.com andchange d both to p(ch3)2))))
version: ES64L-G16RevC.01
frameworkgroup: C1[X(C11H17Cl2NOPd)]
method: RMN15
basis: def2SVP
operation: Freq
keyword: #N
keyword: Geom=AllCheck
keyword: Guess=TCheck
keyword: SCRF=Check
keyword: GenChk
keyword: RMN15/def2SVPFreq
keyword: RMN15/def2SVP
keyword: Freq
title: min nm2166_B irc ( for irc NM1549 (sub 2.17 from nm1243 for ts (from s
converged: YES YES NO NO
title: Mulliken charges:
elementType: C C C C C C H H H H H H H C C H Pd Cl Cl C N C H H H H H H O C H H H
charge: -0.065915 0.136412 -0.088704 -0.117099 0.089764 0.129107 0.019449 0.071108 0.051699 0.002869 0.009401 0.039953 0.010014 0.066640 0.016957 0.013655 -0.117590 -0.279522 -0.279313 -0.250865 0.182141 0.083374 0.088880 0.090336 0.088892 0.072066 0.003176 0.013588 -0.312750 0.157558 0.023272 0.036826 0.014620
chargesum: -0.00000
title: Mulliken charges with hydrogens summed into heavy atoms:
elementType: C C C C C C C C Pd Cl Cl C N C O C
charge: -0.032878 0.279586 -0.085528 -0.065400 0.102034 0.179074 0.066640 0.030611 -0.117590 -0.279522 -0.279313 -0.250865 0.182141 0.351482 -0.312750 0.232276
chargesum: 0.00000
1716.lowfreq: -1.5217 -0.0007 0.0016 0.0028 2.5910 5.5558 9.8438 25.0634 30.2014
frequency: 9.7802 25.0611 30.1988 40.1672 55.7770 74.0467 75.7202 85.4841 109.6801 126.1694 150.3762 164.1330 169.7970 180.3765 193.5273 203.6378 227.8085 264.8104 273.5894 278.7659 304.1828 324.2758 357.6641 380.8315 395.4212 413.7683 422.9693 443.1390 447.5404 504.5924 533.6851 595.1402 671.1014 739.6257 751.2548 780.1479 834.6434 852.8051 858.4084 901.2950 937.4811 962.9130 978.2726 980.2198 992.2413 1015.6074 1023.4560 1024.2646 1032.1853 1038.6169 1114.6523 1135.3237 1172.0107 1195.8248 1204.0492 1211.6093 1239.1943 1274.3626 1309.5842 1310.5903 1340.3122 1369.3269 1379.9896 1391.3025 1415.7335 1416.8411 1420.9498 1432.7924 1445.1730 1448.7124 1464.1986 1471.3320 1595.2008 1720.6718 1756.4443 2474.4420 3038.1987 3097.0273 3101.0680 3111.3958 3125.1972 3163.1901 3175.6865 3180.7444 3189.6332 3198.1778 3198.8007 3209.1513 3212.0751 3212.7899 3213.6308 3300.8158 3317.5852
redmass: 1.0168 5.2158 4.5032 5.7981 4.7029 5.7409 3.7466 5.4591 9.5552 5.8391 4.4248 6.2855 5.6517 4.0206 5.9116 3.0321 5.4751 2.9621 5.1023 1.2719 2.5110 29.8963 2.4055 19.0706 3.4115 2.2481 3.9710 2.6553 4.1506 3.0940 2.5510 2.6664 1.8487 1.3226 1.1913 1.5846 2.0983 1.4861 2.0435 1.8363 1.8370 1.6550 1.5125 2.0259 1.8599 1.4129 1.4893 1.4811 1.5162 1.6707 1.4356 3.5867 1.3131 1.2543 1.4770 1.3979 1.1993 1.2666 1.3739 1.5928 2.0181 1.3108 1.2359 1.1930 1.0360 1.0364 1.4597 1.1856 1.2074 1.0434 1.1133 1.3323 3.8469 6.3897 8.4250 12.6413 1.0368 1.0637 1.0353 1.0645 1.1064 1.1040 1.0996 1.0580 1.0873 1.0907 1.1016 1.0960 1.1051 1.0621 1.1056 1.1195 1.1179
irintensity: 0.0311 3.6730 4.3462 1.7989 3.5171 1.9867 0.6238 0.1278 0.1248 3.6304 0.1581 10.8192 1.3805 4.7710 3.9555 2.5268 6.5857 0.7303 2.9940 1.4902 1.0466 0.8082 2.1541 53.8094 2.9566 2.7561 0.3462 1.0699 0.8373 3.2218 15.1842 0.9782 13.0316 6.2789 2.1781 12.2463 8.8734 74.2451 2.2839 7.8594 14.9514 1.2602 18.7077 9.7477 3.9678 1.1118 7.2270 5.5633 1.0916 2.9919 1.1522 26.8515 1.2553 3.3557 2.8667 1.8160 1.2332 2.5599 0.6386 65.7365 89.2831 0.2662 18.3140 9.8532 13.7519 13.7552 49.3168 12.0888 3.4560 14.6170 21.9504 6.0160 23.5209 98.8648 5.4605 40.6995 30.1216 6.0272 0.6289 26.5484 26.9272 2.9876 3.8531 0.1797 8.0283 0.4032 14.5033 16.4131 2.2856 0.2780 2.3219 0.6038 2.9145
temp: 298.150 k
press: 1.00000 atm
elementType: 6 6 6 6 6 6 1 1 1 1 1 1 1 6 6 1 46 17 17 6 7 6 1 1 1 1 1 1 8 6 1 1 1
symmnumber: 1
zpe: 687807.6 jmol-1
zpe.correction: 0.261972 hartree
zpe.thermalcorrener: 0.283160 hartree
zpe.thermalcorrenthalpy: 0.284104 hartree
zpe.thermalcorrgfe: 0.207769 hartree
zpe.sumelectzpe: -1605.461634 hartree
zpe.sumelectthermal: -1605.440446 hartree
zpe.sumelectthermalent: -1605.439502 hartree
zpe.sumelectthermalfe: -1605.515838 hartree
dipole: -4.5739 -0.9519 -1.4498
dipole: 4.8917
quadrupole: -79.6896 -128.9265 -123.5313
quadrupole: 9.8358 5.7013 -4.9782
quadrupole: 31.0262 -18.2107 -12.8155 9.8358 5.7013 -4.9782
hfenergy: -1605.7236061 hartree
pointgroup: C01 [X(C11H17Cl2N1O1Pd1)]
dipole: 1.8837132 -0.0027252 0.3942635 debye
polarizability: 221.5656736|-6.9558517|164.7356007|-10.7113604|-24.8948306|169.1486561 unknown
InChI: InChI=1S/C9H14O.C2H3N.2ClH.Pd/c1-4-5-6-7-8-9(2)10-3;1-2-3;;;/h4,7-8H,1-2,5-6H2,3H3;1H3;2*1H;/q;;;;+2/p-2
charge 0 multiplicity 1
33 atoms
C  -3.88607777 0.03385736 1.9320944
C  -0.98094952 -0.75011136 -1.09326143
C  -3.69305608 1.48933338 -0.91809038
C  -0.9598028 0.35045834 -0.25362155
C  -2.5822051 2.23821335 -0.2315308
C  -1.18836813 1.76545266 -0.69955941
H  -4.18459159 1.06759983 2.10586296
H  -1.0877592 -0.60989259 -2.17285514
H  -1.03696972 0.1647818 0.82461586
H  -2.64224422 2.12598006 0.8592887
H  -2.67370192 3.31259824 -0.45006619
H  -0.42299101 2.42055331 -0.25376923
H  -1.07948397 1.83744538 -1.79134234
C  -3.90691299 -0.45114408 0.67673487
C  -4.25302426 0.3315014 -0.5330281
H  -4.97678704 -0.15311467 -1.19730188
Pd 1.08233324 -0.38850554 -0.60149187
Cl 0.83212884 -1.60597994 1.34643458
Cl 1.33863271 0.75580193 -2.57820165
C  4.26127852 -0.6464151 -0.38128223
N  3.11529647 -0.54781558 -0.45096958
C  5.70637052 -0.77060311 -0.29530557
H  6.00624977 -1.79006385 -0.57203111
H  6.18270621 -0.05608384 -0.97944406
H  6.03640248 -0.56619977 0.73177663
H  -1.11162041 -1.75367349 -0.6820465
H  -4.02139504 1.90244013 -1.87868915
H  -3.60045533 -0.56839267 2.79492702
O  -3.61551937 -1.7273559 0.33031118
C  -3.0943548 -2.57913576 1.318055
H  -3.79429408 -2.69464967 2.16369837
H  -2.93516026 -3.55872828 0.85098835
H  -2.12673213 -2.19954398 1.69544221
