program: Gaussian 16
title: min nm2166_B irc ( for irc NM1549 (sub 2.17 from nm1243 forts (from s can nm1140 freeze 1 2 at 2.2 and scan 5 6 (took nm1128.comand change d both to p(ch3)2))))
version: EM64M-G16RevA.03
frameworkgroup: C1[X(C10H15Cl2NPd)]
method: RMN15
basis: def2SVP
operation: Freq
keyword: #N
keyword: Geom=AllCheck
keyword: Guess=TCheck
keyword: SCRF=Check
keyword: GenChk
keyword: RMN15/def2SVP
keyword: Freq
title: min nm2166_B irc ( for irc NM1549 (sub 2.17 from nm1243 for ts (from s
converged: YES YES YES YES
title: Mulliken charges:
elementType: C C C C C C H H H H H H H C C H Pd Cl Cl C N C H H H H H H H
charge: 0.076987 0.100702 -0.018609 -0.132443 0.068277 0.020754 0.034907 -0.004444 0.025004 0.066316 0.071514 0.112282 0.074426 -0.050336 -0.013559 0.031928 -0.155716 -0.375921 -0.374059 -0.262394 0.148791 0.096370 0.094425 0.093757 0.094081 0.038461 0.072573 0.020108 0.045820
chargesum: -0.00000
title: Mulliken charges with hydrogens summed into heavy atoms:
elementType: C C C C C C C C Pd Cl Cl C N C
charge: 0.132002 0.134719 0.053964 -0.107439 0.206108 0.207462 -0.004516 0.018368 -0.155716 -0.375921 -0.374059 -0.262394 0.148791 0.378633
1716.lowfreq: -461.6959 -9.3787 0.0003 0.0024 0.0030 1.1628 8.3412 29.9626 36.0045
frequency: -461.6957 29.6724 35.9344 43.2801 60.7934 74.6141 100.5321 116.4298 126.6581 153.9598 166.3382 176.8362 206.0784 208.8308 228.7853 245.5728 249.1132 279.5285 294.8895 312.3354 342.8122 369.7050 402.0217 436.1850 451.1514 501.1284 634.9470 682.0742 745.4654 784.6111 807.7167 853.3938 890.8264 939.0117 958.2204 980.6247 990.9440 1000.7013 1022.3506 1022.6112 1024.3447 1042.7001 1062.8769 1071.9272 1098.8773 1112.2101 1135.1892 1187.0906 1200.1912 1242.7961 1245.8833 1281.8514 1313.3155 1339.3534 1364.1166 1381.9773 1392.8053 1399.9473 1400.8020 1418.8561 1437.4480 1439.6389 1451.7254 1608.9091 1689.6002 2451.7234 3065.7598 3092.3812 3102.3366 3138.4061 3153.0998 3157.3132 3166.0776 3200.2390 3201.8400 3209.8114 3215.2393 3216.6252 3225.8428 3264.1300 3306.2327
redmass: 9.7869 5.0018 4.3950 5.0822 4.6934 1.0125 11.0524 6.6695 4.0360 5.4915 6.1140 3.9274 4.1034 5.1577 4.0846 5.5888 3.1894 4.5713 16.6787 3.5510 4.6834 4.0140 1.9689 4.0571 4.3696 2.0930 2.0847 2.6798 1.4912 2.2304 1.4655 1.4248 2.2125 1.6399 1.4503 3.7229 1.6373 1.3762 1.2099 1.4911 1.4912 1.5059 1.6518 1.3093 1.3733 1.4507 1.1908 1.3212 1.5330 1.1285 1.1562 1.2518 1.5127 1.3159 1.3155 1.2803 1.2214 1.0354 1.0355 1.1455 1.3860 1.6542 1.2754 3.8628 6.7089 12.6358 1.0693 1.0630 1.0353 1.0899 1.0968 1.1009 1.0585 1.0609 1.0859 1.0917 1.1056 1.1060 1.0948 1.1146 1.1176
irintensity: 2182.4320 12.1182 13.1709 2.9927 2.2450 0.0166 1.1062 10.3408 4.4942 4.5163 7.4754 17.5922 3.1194 1.8326 7.0176 10.0145 7.1829 16.9832 6.8096 2.3053 48.5880 23.6490 13.3733 1.1882 1.1302 11.4202 27.6114 38.7115 21.1500 19.0643 29.0756 24.0097 9.5025 54.0157 39.6837 6.9525 28.8616 262.6479 11.4751 12.5025 10.7567 5.7968 3.9710 3.5942 7.6559 0.4605 118.7254 14.7341 13.2104 0.7319 12.8882 16.8458 6.1744 1.2622 0.2498 3.7916 3.6038 19.3253 19.3737 9.4237 16.0111 22.4388 49.9161 246.5870 154.9880 81.1941 23.1634 16.7793 1.1908 12.7723 27.8742 18.3455 14.5161 1.0302 2.6027 8.2228 4.1833 3.9734 10.7222 12.4436 2.3876
temp: 298.150 k
press: 1.00000 atm
elementType: 6 6 6 6 6 6 1 1 1 1 1 1 1 6 6 1 46 17 17 6 7 6 1 1 1 1 1 1 1
symmnumber: 1
zpe: 600753.7 jmol-1
zpe.correction: 0.228815 hartree
zpe.thermalcorrener: 0.246726 hartree
zpe.thermalcorrenthalpy: 0.247670 hartree
zpe.thermalcorrgfe: 0.180582 hartree
zpe.sumelectzpe: -1491.162171 hartree
zpe.sumelectthermal: -1491.144260 hartree
zpe.sumelectthermalent: -1491.143316 hartree
zpe.sumelectthermalfe: -1491.210404 hartree
dipole: -4.3557 -1.7065 -2.5550
dipole: 5.3303
quadrupole: -40.5147 -130.3949 -102.4322
quadrupole: -11.1964 2.6921 -2.4969
quadrupole: 50.5992 -39.2809 -11.3182 -11.1964 2.6921 -2.4969
hfenergy: -1491.3909858 hartree
pointgroup: C01 [X(C10H15Cl2N1Pd1)]
dipole: -1.7136612 -0.6713701 -1.0052154 debye
polarizability: 384.771588|18.8449451|194.7839497|9.3375345|-2.9353023|187.3872541 unknown
InChI: InChI=1S/C8H12.C2H3N.2ClH.Pd/c1-3-5-7-8-6-4-2;1-2-3;;;/h3-5,7H,1-2,6,8H2;1H3;2*1H;/q;;;;+2/p-2
charge 0 multiplicity 1
29 atoms
C  -3.211228 0.167612 1.660947
C  -1.718913 -0.146472 1.438451
C  -3.765413 -0.125042 -1.507098
C  -1.066743 0.605224 0.287457
C  -3.11869 1.096895 -1.451804
C  -1.419281 0.272162 -1.085753
H  -3.415092 1.226581 1.417585
H  -1.577746 -1.229311 1.299304
H  -1.060638 1.69012 0.463319
H  -3.220214 1.744756 -0.580179
H  -2.922109 1.608725 -2.395445
H  -0.923257 0.834417 -1.88402
H  -1.497872 -0.797351 -1.309691
C  -4.151951 -0.738047 0.909899
C  -4.346061 -0.882816 -0.423813
H  -5.002686 -1.696997 -0.743539
Pd 0.922991 0.136901 0.058022
Cl 1.396192 2.412002 0.178114
Cl 0.429166 -2.14889 -0.11028
C  4.097601 -0.566788 -0.134417
N  2.972697 -0.310166 -0.086466
C  5.511417 -0.887188 -0.193036
H  5.905962 -0.99896 0.826035
H  5.656691 -1.827272 -0.742067
H  6.053283 -0.079733 -0.703639
H  -1.172293 0.126215 2.35455
H  -3.819616 -0.606766 -2.49034
H  -3.436778 0.060953 2.730534
H  -4.729615 -1.427828 1.535651
