program: Gaussian 16
title: kys
version: ES64L-G16RevC.01
frameworkgroup: C1[X(C12H19Cl2NPdS2)]
method: RMN15
basis: def2SVP
operation: Freq
keyword: #N
keyword: Geom=AllCheck
keyword: Guess=TCheck
keyword: SCRF=Check
keyword: GenChk
keyword: RMN15/def2SVPFreq
converged: YES YES NO NO
title: Mulliken charges:
elementType: C C C C C C H H H H H H H C C H Pd Cl Cl C N H H S S C H H H C H H H C H H H
charge: -0.058424 0.123023 -0.160100 -0.108299 -0.011740 0.130783 0.019880 0.080956 0.068779 0.014871 0.005395 0.014058 0.039015 -0.026413 0.039016 0.017686 -0.124727 -0.276234 -0.282036 -0.251018 0.183897 -0.008328 0.081911 -0.026346 -0.012373 0.083299 0.087839 0.089878 0.089539 -0.105690 0.057838 0.058625 0.065785 -0.097321 0.066340 0.066679 0.063956
chargesum: 0.00000
title: Mulliken charges with hydrogens summed into heavy atoms:
elementType: C C C C C C C C Pd Cl Cl C N S S C C C
charge: -0.038543 0.285891 -0.160100 -0.039521 0.008526 0.183856 -0.034742 0.056702 -0.124727 -0.276234 -0.282036 -0.251018 0.183897 -0.026346 -0.012373 0.350555 0.076558 0.099655
1716.lowfreq: -0.0030 -0.0025 -0.0020 2.2050 4.1875 7.9249 9.9839 18.0401 23.1846
frequency: 9.9740 18.0286 23.1228 28.7409 37.8915 42.0777 48.3742 56.8010 66.0935 79.5628 95.6383 109.8530 119.6597 138.7783 153.1034 163.2398 170.2443 182.1385 196.2686 214.9740 224.4285 252.3120 259.0021 266.4686 273.7394 304.9312 322.0706 347.6298 361.0208 370.9553 398.1875 422.4290 436.5484 447.1074 452.4023 498.1311 623.6744 632.4902 675.4881 706.2109 753.6022 766.6206 770.3958 822.7508 850.5816 869.0884 884.2947 891.9765 931.0722 952.8824 955.5928 967.6563 976.8828 981.4037 993.5373 996.7662 1000.2246 1023.4902 1024.3538 1047.9440 1049.2486 1119.9589 1195.5163 1221.3178 1247.8884 1249.7988 1288.2934 1290.7282 1315.4658 1326.3634 1331.7121 1346.5806 1369.4223 1396.2448 1407.1264 1415.9090 1416.8554 1419.7779 1423.4506 1434.1750 1439.5279 1441.1235 1586.3854 1695.2429 1723.2302 2474.7439 3063.3619 3076.7025 3080.3972 3100.9899 3105.4100 3167.7620 3170.2476 3182.7241 3183.3435 3186.2313 3191.2976 3192.1644 3206.5951 3207.0720 3211.9550 3213.5245 3228.9616 3296.2122 3301.7645
redmass: 1.0116 5.1945 5.5355 5.0037 4.2778 5.4854 4.4157 3.7542 6.5519 5.2607 3.9860 8.6302 6.3925 1.3429 6.3241 10.0568 6.9917 4.0777 2.5503 4.3050 4.1086 2.6683 1.1386 3.3860 8.9589 4.0747 25.6747 3.7713 3.7339 6.7197 4.6781 3.9889 3.2114 4.3200 2.9304 3.3352 4.0440 3.5803 1.9956 1.2134 5.0808 3.5325 1.8051 2.1115 2.4077 2.6976 1.5076 1.4940 1.8046 1.1972 1.1958 1.3204 1.4080 2.1372 1.4968 1.3366 1.1940 1.4886 1.4811 1.8586 1.4530 1.5916 1.7594 1.3115 1.3322 1.5451 1.2811 1.3043 1.2187 1.1872 1.5150 1.4102 1.3111 1.2077 1.2405 1.0360 1.0363 1.0482 1.0484 1.1395 1.0498 1.0541 3.5979 6.1266 7.1425 12.6411 1.0839 1.0322 1.0324 1.0353 1.0618 1.1056 1.0914 1.0586 1.1085 1.1040 1.0955 1.0626 1.1058 1.1049 1.1051 1.1056 1.0906 1.1159 1.1182
irintensity: 0.0177 2.0518 1.6868 5.6659 2.1752 3.6894 0.5832 0.0365 0.9020 3.3616 0.7468 0.1439 3.7403 0.3071 8.0366 1.8730 1.2826 0.4917 0.9407 1.0458 5.1090 6.4775 0.2378 0.6787 3.9416 1.6471 1.3368 4.8849 3.1947 32.9691 19.4915 0.9128 1.2367 0.8797 2.4708 13.4670 7.4300 4.9230 1.6693 3.7117 1.7091 0.7086 2.7577 0.8417 16.9206 13.3723 22.6950 17.2953 5.0386 7.3234 1.2805 2.2755 9.2491 19.8071 24.8164 7.1750 17.7959 7.0745 5.7492 2.6364 18.5559 4.8223 10.6356 8.7764 10.1942 13.3872 1.2123 11.5221 1.9645 3.7761 4.9084 3.0109 0.1673 2.6814 14.9902 13.6652 13.9597 9.6588 11.3022 9.8019 16.1160 17.1048 34.3425 39.9431 32.5576 41.7038 11.6755 22.3965 28.8195 0.5956 15.7347 7.9737 4.3755 0.2040 5.5943 10.5346 1.3045 1.2367 3.3845 1.4666 2.1641 2.2945 0.4675 4.5302 0.2072
temp: 298.150 k
press: 1.00000 atm
elementType: 6 6 6 6 6 6 1 1 1 1 1 1 1 6 6 1 46 17 17 6 7 1 1 16 16 6 1 1 1 6 1 1 1 6 1 1 1
symmnumber: 1
zpe: 751755.6 jmol-1
zpe.correction: 0.286329 hartree
zpe.thermalcorrener: 0.311797 hartree
zpe.thermalcorrenthalpy: 0.312741 hartree
zpe.thermalcorrgfe: 0.224426 hartree
zpe.sumelectzpe: -2365.429366 hartree
zpe.sumelectthermal: -2365.403897 hartree
zpe.sumelectthermalent: -2365.402953 hartree
zpe.sumelectthermalfe: -2365.491268 hartree
dipole: 2.7093 -1.3466 0.7130
dipole: 3.1084
quadrupole: -84.6740 -158.4736 -149.4703
quadrupole: 17.4531 13.2059 -8.4989
quadrupole: 46.1986 -27.6009 -18.5977 17.4531 13.2059 -8.4989
hfenergy: -2365.7156942 hartree
pointgroup: C01 [X(C12H19Cl2N1Pd1S2)]
dipole: 0.9510806 -0.7327098 0.2326969 debye
polarizability: 293.8108777|-5.9878583|216.4813766|10.8720863|5.1197457|195.3654894 unknown
InChI: InChI=1S/C10H16S2.C2H3N.2ClH.Pd/c1-5-6-10(7-8-11-3)9(2)12-4;1-2-3;;;/h5,7-8,10H,1-2,6H2,3-4H3;1H3;2*1H;/q;;;;+2/p-2
charge 0 multiplicity 1
37 atoms
C  -3.03701947 1.76747077 0.26601313
C  0.17533399 0.0927291 -0.96243532
C  -3.15380698 -1.14344151 0.86257458
C  -0.0847642 -0.96557224 -0.10410785
C  -4.0824243 -1.69711745 1.65891341
C  -0.63580126 -0.87581358 1.2987538
H  -3.91608444 1.20407721 -0.07051276
H  0.00803004 1.13081383 -0.66804907
H  -0.05389388 -1.96107957 -0.556377
H  -4.05391518 -1.4986881 2.73322548
H  -4.88170366 -2.3436698 1.29431252
H  -0.63966963 -1.88008215 1.74590361
H  0.03125833 -0.2418773 1.90140096
C  -2.0618049 1.16815677 0.9618446
C  -2.05617877 -0.26532806 1.43209548
H  -2.24355165 -0.24408793 2.52080336
Pd 2.0861621 -0.44515479 -0.1485238
Cl 2.32262266 -2.1686078 -1.64931423
Cl 1.88996212 1.35305638 1.2966606
C  5.21084415 -0.57112618 0.49889605
N  4.08126613 -0.53807536 0.27362632
H  -1.17784293 1.74669286 1.26266483
H  0.32565615 -0.12249289 -2.02415256
S  -3.03747986 3.47453136 -0.11045972
S  -3.06279106 -1.38570127 -0.8795588
C  6.63538614 -0.6126795 0.78186016
H  6.79911693 -0.97308155 1.80608146
H  7.13591827 -1.2885606 0.07609923
H  7.06145861 0.39461553 0.6842451
C  -4.03830776 3.45899948 -1.60726505
H  -5.02181948 3.00568408 -1.41592001
H  -4.18797322 4.50350705 -1.90979697
H  -3.53693728 2.92011131 -2.42266274
C  -4.34070388 -2.60865921 -1.16796636
H  -4.30040768 -2.85500848 -2.23669475
H  -4.15598727 -3.51990758 -0.58093004
H  -5.33897189 -2.21286182 -0.93131665
