program: Gaussian 16
title: min nm2166_B irc ( for irc NM1549 (sub 2.17 from nm1243 for ts (from s can nm1140 freeze 1 2 at 2.2 and scan 5 6 (took nm1128.com and change d both to p(ch3)2))))
version: ES64L-G16RevC.01
frameworkgroup: C1[X(C16H19Cl2NPd)]
method: RMN15
basis: def2SVP
operation: Freq
keyword: #N
keyword: Geom=AllCheck
keyword: Guess=TCheck
keyword: SCRF=Check
keyword: GenChk
keyword: RMN15/def2SVP
keyword: Freq
title: min nm2166_B irc ( for irc NM1549 (sub 2.17 from nm1243 for ts (from s
converged: YES YES YES YES
title: Mulliken charges:
elementType: C C C C C C H H H H H H H C C H Pd Cl Cl C N C H H H H H H C C C C H C H C H H H
charge: 0.099619 0.034869 -0.053474 -0.136307 0.078706 0.106631 0.029222 0.046248 0.027487 0.022564 0.007495 0.033945 0.003919 -0.066368 0.012263 0.005006 -0.119108 -0.334025 -0.345194 -0.281423 0.203269 0.086280 0.078856 0.078846 0.077443 0.087083 0.024766 0.038856 0.037715 0.003659 0.027839 0.017767 -0.008390 0.021715 0.007504 0.038992 -0.000639 0.002392 0.003969
chargesum: -0.00000
title: Mulliken charges with hydrogens summed into heavy atoms:
elementType: C C C C C C C C Pd Cl Cl C N C C C C C C C
charge: 0.167698 0.168200 -0.028708 -0.108821 0.108766 0.144495 -0.066368 0.017269 -0.119108 -0.334025 -0.345194 -0.281423 0.203269 0.321426 0.037715 -0.004731 0.035343 0.017128 0.024108 0.042961
chargesum: 0.00000
1716.lowfreq: -348.2204 -5.7193 -0.0005 0.0011 0.0019 0.8238 6.2603 19.4230 20.5881
frequency: -348.2204 19.2505 20.5782 22.5198 25.8507 33.8148 38.7735 64.3251 94.2202 110.6947 119.2071 149.7129 153.5923 167.2248 174.5316 197.6318 204.9522 228.6133 235.9457 252.9837 256.3606 299.2131 312.5397 328.6119 356.5157 377.2509 402.5803 414.1279 427.1699 433.4141 443.6773 471.0565 526.4941 610.2281 617.7313 663.6788 693.8447 714.1805 760.2380 775.0820 793.5394 817.0388 820.8706 867.4495 885.9108 911.2645 960.0960 968.2315 969.5272 979.6087 994.2966 1005.0996 1015.9017 1022.9806 1025.0707 1025.9634 1036.8494 1052.8245 1054.3674 1063.7728 1087.1238 1102.5822 1120.5921 1129.3544 1157.6300 1174.3604 1180.7912 1198.1097 1200.6577 1255.7660 1263.1322 1301.6067 1316.1667 1324.6292 1344.6922 1370.7889 1376.0076 1382.8676 1395.9711 1420.3709 1420.7566 1427.1449 1429.2861 1444.0305 1446.0706 1476.0485 1524.7591 1560.2860 1656.0775 1678.2222 1688.5906 2464.1004 3042.6591 3094.1424 3099.6758 3124.2880 3128.6191 3142.2559 3156.6961 3188.8316 3191.4488 3208.2790 3209.7070 3216.8727 3220.2203 3230.7013 3235.2214 3241.0440 3250.1885 3257.0192 3286.7564
redmass: 9.5096 6.2521 1.1159 4.2030 4.2289 4.8188 5.6281 4.0992 8.2225 5.3550 5.5531 4.1031 5.7129 6.1586 4.7838 4.5368 4.7431 5.4157 3.0414 5.5376 4.1907 14.3845 3.8510 4.1730 5.1749 4.6778 2.3880 2.8509 4.2865 3.6210 4.5224 2.7890 3.2001 6.1806 2.5096 4.0946 3.2454 1.5857 1.7134 2.2704 1.8754 1.9953 1.9685 1.2519 1.8148 1.7342 1.4214 1.6009 1.5569 3.7588 4.0204 1.6987 1.3204 1.3801 1.4763 1.4738 1.1926 1.5432 1.9102 1.9167 1.5631 1.4806 1.6075 1.2921 1.0717 1.3510 1.1048 1.4238 1.3144 1.1747 1.0978 1.6139 1.5171 1.5877 1.3709 1.3123 2.8811 1.6211 1.5068 1.0362 1.0365 1.3241 1.3280 1.5419 1.3354 2.3511 2.7573 3.2642 6.4629 6.6271 7.1987 12.6174 1.0708 1.0629 1.0355 1.0844 1.0618 1.0934 1.1040 1.0611 1.0870 1.1050 1.1053 1.0926 1.1113 1.0866 1.0895 1.0928 1.0970 1.1008 1.1145
irintensity: 1302.3042 0.9564 0.2963 1.9424 2.3845 5.9060 5.1415 2.1401 0.6156 0.5941 9.7861 3.2536 2.2815 3.4616 12.1268 8.2305 0.9475 4.2846 5.9487 0.2721 12.3025 2.4826 1.8374 14.1383 33.4620 10.6292 8.0867 1.0461 1.3382 3.6030 0.8830 4.4115 5.0477 0.3742 12.1922 80.7776 8.7609 22.8176 22.7891 20.0059 2.9322 6.6170 13.5177 1.0267 0.9501 25.7456 35.1805 2.7574 0.7966 0.4096 14.6633 48.0246 26.5218 2.4805 5.3800 5.0077 73.1445 0.2602 1.5216 0.6463 2.5727 5.9215 7.6908 2.5863 0.3343 51.9166 9.1174 25.7573 3.6407 1.8813 6.6791 28.8440 10.7893 31.6124 6.6667 0.7853 16.1548 13.9244 5.9626 12.1082 11.8569 7.0643 17.5773 39.7595 13.0026 17.5532 13.3991 101.3482 4.0501 88.4390 87.3189 7.5479 16.3090 10.0323 0.8231 8.9320 6.7186 27.3591 4.9992 0.8045 6.5648 0.4549 0.4824 13.8237 8.4979 0.7345 0.2572 2.9609 7.1137 11.2030 2.0594
temp: 298.150 k
press: 1.00000 atm
elementType: 6 6 6 6 6 6 1 1 1 1 1 1 1 6 6 1 46 17 17 6 7 6 1 1 1 1 1 1 6 6 6 6 1 6 1 6 1 1 1
symmnumber: 1
zpe: 815328.5 jmol-1
zpe.correction: 0.310542 hartree
zpe.thermalcorrener: 0.333096 hartree
zpe.thermalcorrenthalpy: 0.334040 hartree
zpe.thermalcorrgfe: 0.253692 hartree
zpe.sumelectzpe: -1721.625467 hartree
zpe.sumelectthermal: -1721.602913 hartree
zpe.sumelectthermalent: -1721.601969 hartree
zpe.sumelectthermalfe: -1721.682317 hartree
dipole: -5.5160 -2.4305 -0.8373
dipole: 6.0856
quadrupole: -102.4298 -124.7840 -153.3475
quadrupole: -17.9683 -11.7511 -6.4822
quadrupole: 24.4239 2.0698 -26.4937 -17.9683 -11.7511 -6.4822
hfenergy: -1721.9360092 hartree
pointgroup: C01 [X(C16H19Cl2N1Pd1)]
dipole: -2.1478091 -0.8758733 -0.5934518 debye
polarizability: 403.0868979|6.7724505|249.9695715|21.4381391|3.0429208|210.2842041 unknown
InChI: InChI=1S/C14H16.C2H3N.2ClH.Pd/c1-2-5-9-13(10-6-3-1)14-11-7-4-8-12-14;1-2-3;;;/h2,4,6-8,10-12H,1,3,5,9H2;1H3;2*1H;/q;;;;+2/p-2
charge 0 multiplicity 1
39 atoms
C  -2.12864907 0.94330194 1.45138519
C  -0.61635151 0.28689482 0.70676523
C  -2.25767081 2.9519781 -0.89519608
C  0.38230492 1.3541256 0.6077029
C  -0.95544663 3.38264926 -0.26848369
C  0.2224359 2.41231593 -0.47282705
H  -1.85218576 1.94406286 1.78560392
H  -0.8743546 -0.16831054 -0.25835076
H  0.61987956 1.79612867 1.58712073
H  -1.09776193 3.58497679 0.81085909
H  -0.69372493 4.3542139 -0.70979602
H  1.15126302 3.00259248 -0.48964343
H  0.1456525 1.9226228 -1.45600234
C  -2.95006468 0.82575999 0.31623958
C  -3.04733413 1.86882938 -0.69071827
H  -3.89980836 1.75933342 -1.36710424
Pd 1.93849542 0.06938341 0.24920024
Cl 2.62607822 0.44341419 2.42645934
Cl 1.13409203 -0.38231366 -1.90412641
C  4.51631604 -1.81399076 -0.32134631
N  3.5873601 -1.16475686 -0.10777632
C  5.68978986 -2.6308472 -0.58923517
H  5.65581509 -3.00991457 -1.61914541
H  6.59991998 -2.03073684 -0.45762437
H  5.72085959 -3.48058123 0.10551936
H  -0.40696925 -0.48010422 1.46431418
H  -2.61464229 3.61180555 -1.69461246
H  -2.31375985 0.24353606 2.2690423
C  -3.6541496 -0.43875474 0.05604387
C  -4.18298266 -1.21176936 1.10713858
C  -3.76748611 -0.91849569 -1.26367706
C  -4.81795939 -2.42224226 0.84423276
H  -4.1254976 -0.84318789 2.13353012
C  -4.38325804 -2.14038588 -1.52095372
H  -3.32787639 -0.34582899 -2.08382549
C  -4.91547432 -2.89056364 -0.4691071
H  -5.24016073 -3.00369388 1.66610743
H  -4.44260317 -2.51243189 -2.54545485
H  -5.40635642 -3.84457905 -0.6728183
