program: Gaussian 16
title: Title Card Required
version: ES64L-G16RevC.01
frameworkgroup: C1[X(C11H17Cl2NOPd)]
method: RMN15
basis: def2SVP
operation: Freq
keyword: #N
keyword: Geom=AllCheck
keyword: Guess=TCheck
keyword: SCRF=Check
keyword: GenChk
keyword: RMN15/def2SVPFreq
converged: YES YES NO NO
title: Mulliken charges:
elementType: C C C C C C H H H H H H H H C H C H Pd Cl Cl C N H C H H H O C H H H
charge: 0.097390 0.127272 0.077687 -0.120607 -0.035448 0.119322 0.000385 -0.018846 0.071539 0.013187 0.005002 0.020749 0.085873 0.072585 -0.055098 0.000298 -0.045772 0.016506 -0.120219 -0.273372 -0.274144 -0.248116 0.182989 0.033102 0.082704 0.090545 0.088930 0.091313 -0.324858 0.173798 0.029048 0.026132 0.010125
chargesum: -0.00000
title: Mulliken charges with hydrogens summed into heavy atoms:
elementType: C C C C C C C C Pd Cl Cl C N C O C
charge: 0.102777 0.141528 0.077687 -0.049068 -0.001513 0.277780 -0.054801 -0.029266 -0.120219 -0.273372 -0.274144 -0.248116 0.182989 0.353493 -0.324858 0.239103
1716.lowfreq: -4.0354 -2.3543 -0.0021 -0.0015 0.0005 1.8069 14.4892 18.8173 20.2754
frequency: 14.4398 18.7929 20.2262 30.6519 35.9080 61.3329 65.2068 76.4846 89.7332 102.6083 110.8406 155.3940 162.4227 174.3072 183.1425 190.1622 212.7023 222.6467 235.4989 275.4135 296.2590 325.7522 332.2876 380.0377 389.4687 407.7987 423.6277 447.9115 459.8141 477.4581 521.9708 581.1336 676.3552 753.2593 760.8856 775.2719 784.0927 872.0644 893.2916 916.3436 932.5025 953.8953 982.0732 996.5320 1002.2329 1017.2913 1023.5903 1024.0575 1040.2414 1044.7916 1111.7492 1155.4001 1164.0246 1187.9714 1201.9592 1227.4554 1242.1987 1264.9646 1284.3424 1302.5321 1341.6915 1369.3933 1370.0012 1390.6765 1410.3211 1415.4881 1416.6955 1437.0299 1444.6794 1451.9857 1469.7143 1473.0003 1593.7792 1732.4503 1750.6256 2475.4751 3047.0679 3095.2346 3100.9937 3104.1622 3131.6343 3159.3960 3170.4412 3177.2487 3178.9506 3194.5309 3200.8816 3201.6294 3204.8823 3212.1577 3213.7508 3290.5772 3315.1746
redmass: 5.8408 1.0309 4.4528 4.3819 4.4795 3.9820 4.6881 3.9245 3.3390 2.5404 11.9225 11.5219 6.6586 4.5853 2.6543 1.7324 3.5696 4.0536 3.3817 8.9941 2.9343 27.6735 2.6718 14.6030 3.9883 2.5332 3.9845 4.6999 3.0974 2.5570 2.7857 2.6264 2.2681 1.2341 1.1825 1.4041 1.5161 2.7286 1.6125 1.7820 1.4118 1.9893 2.3841 1.5225 1.5988 1.3422 1.4903 1.4815 1.4642 2.4793 1.4749 3.6476 1.3334 1.4394 1.3943 1.2095 1.2882 1.2062 1.2164 2.1275 1.6307 1.3101 1.2584 1.2049 1.5877 1.0359 1.0364 1.1965 1.0912 1.1546 1.1839 1.0952 3.8543 6.4814 8.4100 12.6435 1.0360 1.0650 1.0353 1.0646 1.1061 1.1008 1.0575 1.0946 1.0932 1.1026 1.0616 1.0911 1.0957 1.1051 1.1056 1.1201 1.1194
irintensity: 0.3884 0.0284 0.4633 4.9521 4.6489 3.0823 1.5808 0.3212 8.2251 0.3063 0.9279 4.2645 1.9049 1.7597 1.3577 5.8896 1.0856 1.9576 4.6324 2.6527 3.1676 0.3558 1.2509 50.9176 4.2905 4.9817 0.2117 0.1638 6.0128 7.0828 11.9351 4.2608 15.4235 1.0016 1.5050 4.4109 11.8672 8.4783 48.7477 12.9258 0.9433 4.4508 12.0865 13.1093 3.5046 0.9113 6.9647 5.6960 2.9485 8.3661 3.1706 55.5942 14.5161 4.8367 3.8258 1.5108 4.1492 0.0824 4.7316 107.0152 16.0536 0.7499 20.4606 13.7204 41.9868 13.9527 14.0521 18.1020 27.7540 0.0973 12.5270 7.3295 24.1201 96.7603 6.2465 42.9705 30.8880 4.7725 0.8472 22.9981 15.5238 4.3236 0.1700 3.3013 5.7495 23.7017 0.0572 0.2977 22.0871 2.4326 2.6057 0.3149 2.7378
temp: 298.150 k
press: 1.00000 atm
elementType: 6 6 6 6 6 6 1 1 1 1 1 1 1 1 6 1 6 1 46 17 17 6 7 1 6 1 1 1 8 6 1 1 1
symmnumber: 1
zpe: 685547.1 jmol-1
zpe.correction: 0.261111 hartree
zpe.thermalcorrener: 0.282878 hartree
zpe.thermalcorrenthalpy: 0.283822 hartree
zpe.thermalcorrgfe: 0.204637 hartree
zpe.sumelectzpe: -1605.452517 hartree
zpe.sumelectthermal: -1605.430750 hartree
zpe.sumelectthermalent: -1605.429806 hartree
zpe.sumelectthermalfe: -1605.508991 hartree
dipole: -4.6928 2.3937 2.8047
dipole: 5.9681
quadrupole: -100.9355 -122.1968 -119.9149
quadrupole: -29.0380 -1.6733 6.4628
quadrupole: 13.4136 -7.8478 -5.5658 -29.0380 -1.6733 6.4628
hfenergy: -1605.7136279 hartree
pointgroup: C01 [X(C11H17Cl2N1O1Pd1)]
dipole: -1.9000456 0.9075923 1.0389543 debye
polarizability: 222.0063857|0.1864915|189.9765373|-11.8432047|-3.8728459|148.6303245 unknown
InChI: InChI=1S/C9H14O.C2H3N.2ClH.Pd/c1-4-5-6-7-8-9(2)10-3;1-2-3;;;/h4,7-8H,1-2,5-6H2,3H3;1H3;2*1H;/q;;;;+2/p-2
charge 0 multiplicity 1
33 atoms
C  2.77861542 -1.54000054 0.96366324
C  1.47487043 -0.74428442 0.76249583
C  4.39896724 0.63105837 -0.58578208
C  0.43701627 -1.59970922 0.10094163
C  4.53169002 -0.25627661 -1.5837015
C  0.14346899 -1.54950916 -1.25111367
H  3.07924264 -1.95987831 -0.00634968
H  1.67643843 0.13784728 0.13919237
H  0.06756838 -2.46347355 0.66633864
H  4.77234008 -1.29894225 -1.37368149
H  2.5986728 -2.39288044 1.63605645
H  4.45684273 0.0792194 -2.61966059
H  -0.40026404 -2.37077149 -1.72541664
H  0.63441454 -0.806547 -1.88757201
C  3.85906445 -0.65287973 1.5281352
H  4.07085929 -0.75505261 2.59795372
C  4.52068957 0.30281513 0.85689244
H  5.21449147 0.9478301 1.41030876
Pd -1.4545541 -0.51458543 -0.24857845
Cl -2.51301241 -2.50385607 0.20406129
Cl -0.46369072 1.49694965 -0.7957486
C  -4.14923044 1.07645474 0.3812388
N  -3.1762977 0.49630037 0.17036845
H  1.10674787 -0.38115346 1.73560751
C  -5.37613384 1.80813005 0.64583811
H  -6.21519665 1.32342762 0.1294024
H  -5.57620152 1.81658774 1.72550652
H  -5.27726788 2.84152172 0.28828298
O  4.26051424 1.95382073 -0.87900598
C  3.25197561 2.66353585 -0.19636642
H  3.36610341 3.72388399 -0.45461993
H  2.24495092 2.32935545 -0.50144748
H  3.33806349 2.55548709 0.8989502
