program: Gaussian 16
title: Title Card Required
version: ES64L-G16RevC.01
frameworkgroup: C1[X(C12H20Cl2N2Pd)]
method: RMN15
basis: def2SVP
operation: Freq
keyword: #N
keyword: Geom=AllCheck
keyword: Guess=TCheck
keyword: SCRF=Check
keyword: GenChk
keyword: RMN15/def2SVP
keyword: Freq
converged: YES YES NO NO
title: Mulliken charges:
elementType: C C C C C C H H H H H H H C H C H Pd Cl Cl C N H H C H H H N C H H H C H H H
charge: 0.060637 0.144097 -0.024264 -0.142585 0.070914 0.093562 -0.028759 0.031959 0.054705 0.023235 0.008273 0.003321 0.038107 -0.091850 0.060233 0.058509 0.022890 -0.077067 -0.236681 -0.298746 -0.260839 0.166605 0.014332 -0.004559 0.085115 0.078113 0.086206 0.084637 -0.308505 0.124220 0.022637 -0.019969 0.010784 0.129383 -0.025306 0.015751 0.030906
chargesum: -0.00000
title: Mulliken charges with hydrogens summed into heavy atoms:
elementType: C C C C C C C C Pd Cl Cl C N C N C C
charge: 0.031878 0.171497 -0.009932 -0.087880 0.102423 0.134990 -0.031617 0.081398 -0.077067 -0.236681 -0.298746 -0.260839 0.166605 0.334071 -0.308505 0.137672 0.150734
chargesum: 0.00000
1716.lowfreq: -8.3413 -4.3500 -0.0003 0.0010 0.0019 4.9809 13.6884 23.4679 24.4791
frequency: 13.6800 23.4237 24.4638 43.1407 56.2932 75.1768 89.1384 121.8942 134.2820 145.0721 163.6713 178.0934 188.3771 194.9571 220.5945 227.5442 247.4580 261.2303 280.4297 302.0198 313.9451 335.7559 352.2744 366.6183 401.4336 413.1368 427.0105 430.4802 433.7005 497.6941 508.2305 532.6701 575.9169 680.8556 689.2941 737.8302 816.1437 840.2159 879.4097 927.5187 937.5046 950.2009 972.2211 986.8727 997.2497 1015.1739 1024.7992 1026.4197 1043.5033 1057.0433 1065.6898 1073.4928 1090.7280 1094.9714 1113.2957 1129.2261 1156.9670 1176.2317 1221.7329 1226.1058 1248.1328 1258.6808 1290.3275 1303.3907 1312.7695 1327.0702 1338.3692 1350.2133 1369.4272 1370.2658 1392.5429 1408.9938 1411.0001 1416.1137 1418.3921 1419.8553 1423.6932 1433.4041 1440.8297 1444.2693 1450.2762 1457.5631 1465.5646 1684.2542 2458.9904 2938.8395 2946.1707 2951.8427 3041.8801 3054.8326 3076.7968 3101.0108 3113.2155 3118.4770 3130.3390 3143.2531 3171.8387 3184.0500 3186.0462 3188.6695 3194.2320 3204.2634 3211.0163 3211.8467 3222.2193
redmass: 1.0822 3.1279 4.5311 7.7465 2.9678 4.3947 7.8648 5.8976 5.5599 10.7132 9.9029 2.6845 6.9738 6.2340 2.4113 2.7856 1.1086 2.2995 2.2053 16.8639 4.0476 3.2206 3.3040 3.2286 5.6280 3.6397 3.3278 3.6421 2.7603 2.7503 2.3611 2.3352 3.0172 4.0518 2.4387 1.4670 2.2033 2.4036 2.0387 1.9438 2.8529 1.7592 3.7565 1.7095 1.6808 1.6229 1.4808 1.4891 1.2713 1.3416 1.8607 1.6272 1.8877 1.2927 1.3272 1.3686 1.5362 1.3582 1.1437 1.3758 1.2924 1.4763 2.0235 2.0755 1.8716 1.6029 1.7978 1.5863 1.5041 1.3670 1.3887 1.2142 1.1487 1.1682 1.0361 1.0368 1.5843 1.0737 1.1333 1.0826 1.0724 1.2542 1.1221 6.8883 12.6221 1.0799 1.0595 1.0604 1.0724 1.0711 1.0676 1.0355 1.0872 1.0749 1.0770 1.0969 1.1045 1.0928 1.0880 1.0988 1.0975 1.0870 1.1051 1.1054 1.0968
irintensity: 0.4642 3.8673 6.9907 2.5296 0.0908 0.0780 1.0159 2.4873 6.0446 3.8799 2.4553 0.2216 10.2566 4.5996 1.9234 0.1928 0.1510 1.5590 1.4939 14.1618 5.6688 3.7222 13.4395 14.9238 12.9876 0.1778 0.8189 1.1583 0.2081 11.4380 1.0213 4.1269 25.7957 0.1814 20.1353 41.2965 4.3512 1.9376 16.6745 2.1917 25.4204 4.6651 10.1227 12.7211 13.4566 2.3832 4.8075 5.0789 46.1785 18.0080 24.7944 12.0008 15.9728 1.9678 7.0581 7.9448 15.1135 21.7397 3.6938 18.8505 6.2869 15.5870 30.3447 6.1917 19.7928 14.5468 2.3275 2.8863 0.2598 0.8102 28.6332 0.2372 8.4698 16.9532 12.6792 12.9361 13.8743 8.8323 5.1702 2.6738 15.3994 14.0676 14.6060 65.7257 56.4954 32.1942 32.7280 156.7407 22.1155 48.3178 11.1031 0.0410 7.3383 22.3597 26.1266 23.4653 27.0017 3.5818 1.6622 9.0221 6.3178 1.7519 0.8541 1.3933 12.5072
temp: 298.150 k
press: 1.00000 atm
elementType: 6 6 6 6 6 6 1 1 1 1 1 1 1 6 1 6 1 46 17 17 6 7 1 1 6 1 1 1 7 6 1 1 1 6 1 1 1
symmnumber: 1
zpe: 800276.2 jmol-1
zpe.correction: 0.304809 hartree
zpe.thermalcorrener: 0.325918 hartree
zpe.thermalcorrenthalpy: 0.326862 hartree
zpe.thermalcorrgfe: 0.251773 hartree
zpe.sumelectzpe: -1624.770517 hartree
zpe.sumelectthermal: -1624.749408 hartree
zpe.sumelectthermalent: -1624.748463 hartree
zpe.sumelectthermalfe: -1624.823553 hartree
dipole: -1.1308 -2.0708 3.9672
dipole: 4.6158
quadrupole: -102.2557 -131.6468 -128.7554
quadrupole: 20.5940 -9.1492 -7.2906
quadrupole: 18.6303 -10.7608 -7.8694 20.5940 -9.1492 -7.2906
hfenergy: -1625.0753258 hartree
pointgroup: C01 [X(C12H20Cl2N2Pd1)]
dipole: -0.3636416 -0.6112977 1.6709067 debye
polarizability: 228.8027608|13.3612105|212.2687856|-7.2563873|2.047561|170.2594203 unknown
InChI: InChI=1S/C10H17N.C2H3N.2ClH.Pd/c1-11(2)10-8-6-4-3-5-7-9-10;1-2-3;;;/h4,6-8,10H,3,5,9H2,1-2H3;1H3;2*1H;/q;;;;+2/p-2
charge 0 multiplicity 1
37 atoms
C  2.34422751 -0.17872334 0.17959415
C  2.2139683 0.17697687 -1.30575117
C  1.02107237 2.37121109 1.38646531
C  0.97098102 1.03319535 -1.53474125
C  1.78864277 2.83889692 0.1852975
C  1.17531155 2.49808642 -1.19157474
H  2.98906087 0.5789167 0.68285107
H  2.10250017 -0.75731579 -1.86722521
H  0.60465228 0.94953601 -2.57059958
H  2.8183902 2.44333986 0.21912418
H  1.89529704 3.93172336 0.2390629
H  1.89220988 2.87900599 -1.94397867
H  0.23753059 3.04961568 -1.32914916
C  0.96366231 -0.07254068 0.85080176
H  0.65140622 -1.03293186 1.27816857
C  0.64901281 1.10081013 1.6658588
H  -0.01596866 0.93417832 2.51897423
Pd -0.57479198 0.09661895 -0.57146114
Cl 0.04422447 -2.01126836 -1.27978114
Cl -1.84525602 2.05473148 -0.3804934
C  -3.23259399 -1.39026561 0.89806955
N  -2.28260696 -0.90885859 0.45395941
H  0.65935427 3.14646915 2.06887034
H  3.11348093 0.70549544 -1.67227508
C  -4.43852639 -1.99187151 1.44540058
H  -4.27777025 -2.2678493 2.49583346
H  -5.26954963 -1.27670845 1.38566298
H  -4.69693001 -2.89327024 0.87423059
N  2.92553293 -1.48923572 0.42889511
C  3.24301138 -1.65656693 1.83017681
H  3.58209588 -2.68476075 2.0241157
H  4.04552058 -0.95915678 2.16632944
H  2.36299271 -1.47216874 2.4638793
C  4.09293206 -1.76712298 -0.37834097
H  4.90806835 -1.02291794 -0.221123
H  4.49191823 -2.75635711 -0.11021822
H  3.85002619 -1.79131103 -1.44816201
