program: Gaussian 16
title: kys
version: ES64L-G16RevA.03
frameworkgroup: C1[X(C10H15Cl2NPdS2)]
method: RMN15
basis: def2SVP
operation: Freq
keyword: #N
keyword: Geom=AllCheck
keyword: Guess=TCheck
keyword: SCRF=Check
keyword: GenChk
keyword: RMN15/def2SVP
keyword: Freq
converged: YES YES NO NO
title: Mulliken charges:
elementType: C C C C C C H H H H H H H C C H Pd Cl Cl C N H H S H S H C H H H
charge: -0.214055 0.095374 -0.100556 -0.143298 -0.013413 0.079924 0.082168 0.038324 0.051362 0.026924 0.019291 0.075083 0.043933 0.102556 -0.064441 0.025550 -0.086203 -0.304008 -0.329403 -0.273814 0.206118 0.063895 0.069481 0.024949 0.069938 0.054591 0.069496 0.085564 0.083340 0.080688 0.080640
chargesum: -0.00000
title: Mulliken charges with hydrogens summed into heavy atoms:
elementType: C C C C C C C C Pd Cl Cl C N S S C
charge: -0.131887 0.203179 -0.100556 -0.091936 0.032803 0.198940 0.166451 -0.038891 -0.086203 -0.304008 -0.329403 -0.273814 0.206118 0.094887 0.124088 0.330232
chargesum: 0.00000
1716.lowfreq: -301.8528 -7.8500 -3.6998 -2.6915 0.0011 0.0014 0.0024 5.4439 23.8984
frequency: -301.8511 5.3620 23.7664 26.3762 31.4216 32.9333 62.3244 82.3355 101.6180 107.9762 129.9764 145.7302 162.8314 164.1264 183.2722 190.7248 194.2124 215.8137 225.8285 251.3411 269.0048 284.1475 308.3788 321.1313 347.2295 367.9086 388.6150 411.5256 430.6389 436.8865 454.4951 521.8539 595.4784 638.1960 656.0330 692.0886 712.1775 820.0802 859.0231 869.1047 894.2206 900.0961 918.6975 938.7737 949.4342 972.4303 984.1662 1006.9562 1024.8458 1024.9693 1056.4598 1062.9706 1106.7424 1160.9987 1181.4667 1197.7677 1220.6198 1221.6892 1243.6756 1264.3985 1282.1760 1366.4574 1370.5441 1375.5044 1419.0393 1419.7213 1430.6844 1445.6754 1453.2229 1543.7581 1694.3670 2469.7401 2755.6663 2760.8857 3100.0778 3111.2614 3126.0717 3166.8046 3174.6426 3179.2993 3187.4482 3192.5791 3201.2575 3209.4817 3210.6566 3217.6426 3292.5097
redmass: 8.1550 1.0105 6.9221 4.7429 4.8344 8.7489 8.6651 6.2360 7.6986 11.6894 5.5989 7.3993 3.3428 3.0023 1.5396 1.7510 2.4093 5.7626 5.0307 4.2932 10.0047 4.2509 26.2720 4.5545 5.6458 12.7717 2.8359 2.7757 4.2758 2.5645 3.2099 6.4944 3.9224 3.9224 4.0854 1.9736 1.7118 1.7204 1.7504 1.6460 1.3843 1.3761 1.6135 1.2257 1.1873 1.9686 3.4932 1.1496 1.4780 1.4752 1.1965 1.1764 1.6357 1.2278 1.2655 1.5555 1.2230 1.6755 1.4226 1.5205 1.5132 1.3739 1.3121 1.2879 1.0361 1.0364 1.5306 1.1746 1.5535 4.7842 6.0857 12.6252 1.0383 1.0382 1.0355 1.0601 1.0593 1.0869 1.0898 1.0892 1.0623 1.0899 1.1087 1.1051 1.1054 1.1124 1.1182
irintensity: 100.1866 0.0027 1.3721 2.6455 6.1467 3.9385 1.9772 5.3705 1.8632 3.4352 0.6820 1.6450 2.2090 7.6732 7.3162 9.6955 6.5400 0.8861 16.0444 7.9316 23.2475 8.1036 4.1687 0.4677 1.1301 58.4136 81.6257 43.5095 0.3541 0.8387 5.4963 138.8246 12.4734 7.0030 4.5848 82.1104 26.5084 19.9597 28.2525 109.2707 65.7356 56.8048 12.8655 12.5748 21.3809 39.8551 2.5445 23.3988 5.6646 5.1381 37.8411 4.9479 14.3804 7.6642 13.3849 11.9037 41.5473 6.6663 10.2486 6.0653 3.6245 3.3487 0.0519 0.8057 12.6103 12.8042 24.6201 12.0222 3.1762 10.9700 40.6868 10.5889 1.8128 4.0621 0.1889 10.1373 9.1453 3.4056 5.9687 8.4028 0.1550 2.4687 1.0585 0.7365 0.9497 1.8919 2.8373
temp: 298.150 k
press: 1.00000 atm
elementType: 6 6 6 6 6 6 1 1 1 1 1 1 1 6 6 1 46 17 17 6 7 1 1 16 1 16 1 6 1 1 1
symmnumber: 1
zpe: 593410.7 jmol-1
zpe.correction: 0.226018 hartree
zpe.thermalcorrener: 0.247793 hartree
zpe.thermalcorrenthalpy: 0.248737 hartree
zpe.thermalcorrgfe: 0.169540 hartree
zpe.sumelectzpe: -2286.988387 hartree
zpe.sumelectthermal: -2286.966613 hartree
zpe.sumelectthermalent: -2286.965668 hartree
zpe.sumelectthermalfe: -2287.044865 hartree
dipole: -1.0264 -0.0170 1.3508
dipole: 1.6966
quadrupole: -83.1276 -143.3520 -137.9240
quadrupole: 7.6071 -3.3068 -11.0636
quadrupole: 38.3403 -21.8842 -16.4561 7.6071 -3.3068 -11.0636
hfenergy: -2287.2144053 hartree
pointgroup: C01 [X(C10H15Cl2N1Pd1S2)]
dipole: -0.3972588 -0.0845368 0.5297234 debye
polarizability: 301.6495284|-1.0996076|196.6483329|-19.6920056|1.7108609|177.0681518 unknown
InChI: InChI=1S/C8H12S2.C2H3N.2ClH.Pd/c1-6(9)7-3-2-4-8(10)5-7;1-2-3;;;/h2,5,7-10H,1,3-4H2;1H3;2*1H;/q;;;;+2/p-2
charge 0 multiplicity 1
31 atoms
C  -2.61333328 1.4260564 -0.46038678
C  -0.91134564 1.29845734 -0.48224397
C  -3.37539204 -1.55589053 0.68374332
C  -0.53062887 -0.08895853 -0.17282169
C  -4.05565166 -2.40411096 1.47116166
C  -0.95493094 -0.51304416 1.16558484
H  -2.95216754 0.74961887 -1.25386245
H  -0.54849828 2.0265541 0.25610871
H  -0.73373537 -0.80976532 -0.97377231
H  -4.1389219 -2.21623207 2.54418843
H  -4.54596349 -3.29597695 1.07479961
H  -0.81611132 -1.57708417 1.40298231
H  -0.56528512 0.13422437 1.9613826
C  -2.84500538 0.98031771 0.87377182
C  -2.70455575 -0.36576512 1.31951142
H  -2.84277469 -0.44141575 2.40492449
Pd 1.5449996 -0.06624764 -0.07737069
Cl 1.56589448 -1.58607247 -1.8068886
Cl 1.53144887 1.49430017 1.66202134
C  4.75135542 -0.09206719 -0.00614569
N  3.59887214 -0.07939697 -0.02922004
H  -2.78797131 1.75926539 1.6456654
H  -0.66747082 1.62828118 -1.50350316
S  -3.08763468 3.14026749 -0.7325588
H  -2.15916538 3.39901925 -1.66444354
S  -3.20634352 -1.78948884 -1.05615929
H  -4.10676084 -2.77822328 -1.14641361
C  6.20518512 -0.11139098 0.01997639
H  6.58354516 -0.78047171 -0.76409374
H  6.59532054 0.90059593 -0.15132948
H  6.55620349 -0.46811756 0.99733451
