program: Gaussian 16
title: kys
version: ES64L-G16RevC.01
frameworkgroup: C1[X(C12H19Cl2NO2Pd)]
method: RMN15
basis: def2SVP
operation: Freq
keyword: #N
keyword: Geom=AllCheck
keyword: Guess=TCheck
keyword: SCRF=Check
keyword: GenChk
keyword: RMN15/def2SVPFreq
converged: YES YES NO NO
title: Mulliken charges:
elementType: C C C C C C H H H H H H H C C H Pd Cl Cl C N H C H H H H O C H H H O C H H H
charge: 0.017044 0.174138 0.036920 -0.029788 -0.077801 0.135837 0.012433 0.057711 0.060617 0.008016 0.003761 0.013589 0.029375 -0.059061 0.061794 0.009815 -0.167859 -0.272603 -0.294747 -0.254967 0.185496 0.015430 0.084281 0.086278 0.088209 0.087395 -0.003631 -0.297829 0.166075 0.044386 0.024005 0.017789 -0.252697 0.169954 0.039349 0.031297 0.049987
chargesum: 0.00000
title: Mulliken charges with hydrogens summed into heavy atoms:
elementType: C C C C C C C C Pd Cl Cl C N C O C O C
charge: 0.044907 0.231849 0.036920 0.030829 -0.066024 0.178801 -0.062692 0.071609 -0.167859 -0.272603 -0.294747 -0.254967 0.185496 0.346163 -0.297829 0.252256 -0.252697 0.290586
1716.lowfreq: -5.8604 -1.5738 -0.0033 -0.0020 -0.0018 4.9700 14.6179 21.6618 28.4354
frequency: 14.6005 21.6553 28.4345 36.8661 44.0063 54.4810 65.7400 75.0194 81.3102 96.4484 108.8480 127.6908 138.6364 149.5796 155.3668 164.6295 174.5182 199.2398 207.9020 217.3662 236.1885 260.4209 271.5509 275.2576 310.0868 315.9447 343.2179 371.6959 400.4717 420.6167 436.4748 447.5734 463.4937 486.5555 492.1487 547.3140 585.5578 690.6458 735.7463 739.4379 834.5567 852.0395 862.2507 906.7860 938.3859 949.7353 972.9620 977.2847 985.0609 1003.5684 1023.6973 1024.6931 1045.2482 1064.6199 1080.0047 1106.6241 1156.9975 1168.0488 1170.9488 1183.9473 1206.7066 1218.7753 1233.1776 1272.4414 1294.3568 1303.2515 1320.9381 1340.1868 1351.0060 1369.6040 1382.7372 1409.9363 1414.2358 1416.6188 1417.6081 1434.0827 1437.6849 1446.5190 1448.5971 1463.4986 1464.1322 1467.6277 1632.5945 1739.1986 1740.1921 2471.9142 3043.9787 3054.4359 3086.2424 3100.9166 3112.6585 3124.6725 3147.7768 3170.1916 3173.2602 3182.6498 3188.6243 3207.1257 3210.8652 3211.4360 3212.7028 3213.1093 3226.3148 3280.8433 3313.8623
redmass: 1.0128 4.4600 4.3787 4.6312 5.1204 4.9119 4.3570 3.3835 3.4162 3.3889 10.6638 5.1468 5.1520 5.5661 1.3727 6.8150 7.3519 3.3795 2.8988 4.9766 3.3181 5.3525 8.9137 1.0648 2.3237 18.6110 2.7693 9.6341 3.7931 4.0043 3.2987 4.2148 2.8999 3.4164 3.3805 2.8860 1.7634 2.1316 1.6042 2.0980 2.6645 1.4688 1.8872 1.5513 1.8384 1.3972 1.6904 1.4954 3.3000 1.5823 1.4870 1.4801 1.1739 1.7324 2.5134 1.9505 1.3603 1.3100 2.4945 1.4721 1.4997 1.4954 1.4772 1.3139 1.4351 1.4431 1.4508 2.0065 1.9061 1.3121 1.7429 1.2671 1.5374 1.0360 1.0364 1.0493 1.1215 1.0396 1.1950 1.0740 1.1197 1.3267 4.5120 5.6549 6.4120 12.6367 1.0362 1.0351 1.0840 1.0353 1.0631 1.1059 1.1066 1.0732 1.1046 1.0821 1.0925 1.1016 1.0634 1.1051 1.1040 1.1056 1.0886 1.1172 1.1178
irintensity: 0.0099 2.6725 5.5537 2.3550 3.0910 0.5185 1.1677 1.0222 3.7210 1.4582 0.3695 7.0527 1.5071 2.5571 0.5957 2.5605 2.2422 1.0012 2.7328 1.5209 1.4277 4.2688 4.2351 0.0689 4.1312 3.7041 2.2790 48.8387 11.1398 1.1757 2.5856 0.6394 7.7635 3.5869 28.8270 7.4768 9.9712 3.4077 1.3479 2.3079 7.4941 48.8546 12.7557 76.0228 8.2453 52.8784 8.5781 8.1256 4.1589 2.4289 6.6560 5.4171 11.1110 12.8050 27.0164 1.6416 16.5986 1.7456 54.9649 10.1811 12.5914 17.4456 20.2747 4.9669 5.2723 23.4731 34.6842 116.3601 110.7855 0.4921 69.9281 6.7733 21.1161 13.3368 13.5371 8.8249 14.2511 8.4726 1.6741 20.5068 29.1304 2.3371 167.4900 24.6062 131.9317 38.2832 46.2354 38.0298 8.6173 0.2720 20.5809 30.2610 12.9081 5.1366 5.3193 4.2745 3.9780 9.4714 0.1854 1.8104 16.6023 1.9512 0.6439 8.0045 4.2225
temp: 298.150 k
press: 1.00000 atm
elementType: 6 6 6 6 6 6 1 1 1 1 1 1 1 6 6 1 46 17 17 6 7 1 6 1 1 1 1 8 6 1 1 1 8 6 1 1 1
symmnumber: 1
zpe: 773143.4 jmol-1
zpe.correction: 0.294475 hartree
zpe.thermalcorrener: 0.318721 hartree
zpe.thermalcorrenthalpy: 0.319665 hartree
zpe.thermalcorrgfe: 0.236207 hartree
zpe.sumelectzpe: -1719.732952 hartree
zpe.sumelectthermal: -1719.708706 hartree
zpe.sumelectthermalent: -1719.707762 hartree
zpe.sumelectthermalfe: -1719.791221 hartree
dipole: -3.7108 -0.0804 0.7025
dipole: 3.7776
quadrupole: -82.6812 -145.5711 -129.8282
quadrupole: -10.9312 2.5059 -8.8628
quadrupole: 36.6790 -26.2110 -10.4680 -10.9312 2.5059 -8.8628
hfenergy: -1720.0274272 hartree
pointgroup: C01 [X(C12H19Cl2N1O2Pd1)]
dipole: -1.4432754 0.3092132 0.1736385 debye
polarizability: 259.932962|-0.5412313|169.4288266|-0.0078699|-4.6791847|181.840083 unknown
InChI: InChI=1S/C10H16O2.C2H3N.2ClH.Pd/c1-5-10(9(2)12-4)7-6-8-11-3;1-2-3;;;/h5-6,8,10H,1-2,7H2,3-4H3;1H3;2*1H;/q;;;;+2/p-2
charge 0 multiplicity 1
37 atoms
C  3.71609368 1.87452414 -1.13375299
C  0.69223463 0.66376626 0.62088951
C  3.79157124 -1.01760513 -0.69950246
C  0.82193297 -0.60884166 0.06933608
C  4.83056819 -1.75914336 -1.11741556
C  1.32120796 -0.93064057 -1.32184062
H  4.56416199 1.46504403 -0.57664734
H  0.67953411 1.57768223 0.01159898
H  0.93578233 -1.3878882 0.82854692
H  4.94805349 -1.95319908 -2.18366137
H  5.57202401 -2.18191768 -0.4388114
H  1.28810142 -2.02143471 -1.45530704
H  0.65947917 -0.48487859 -2.0773517
C  2.78240679 1.08350272 -1.66665412
C  2.75566103 -0.42665509 -1.61996512
H  2.99252879 -0.78644592 -2.63587028
Pd -1.29789564 -0.16564983 0.02644051
Cl -1.51162199 -1.44670867 1.91867592
Cl -1.15695184 1.24112239 -1.82359299
C  -4.48456313 -0.21673264 -0.34152643
N  -3.34176371 -0.18321565 -0.19580541
H  3.66415613 2.96057141 -1.24114709
C  -5.92559906 -0.26011708 -0.52511256
H  -6.42643556 0.11953597 0.37524519
H  -6.21078655 0.35818431 -1.38639866
H  -6.24491374 -1.29573657 -0.7019432
H  1.93352923 1.52828046 -2.20313805
O  3.53190816 -0.7004931 0.58959261
C  4.39678548 -1.16689313 1.58737387
H  4.00587198 -0.81117868 2.54788792
H  4.44067199 -2.26986138 1.59701631
H  5.42053533 -0.77940523 1.44035923
O  0.79058738 0.81896044 1.93850289
C  0.02172832 1.85595895 2.50683839
H  0.43168487 2.07420117 3.49979976
H  0.05810932 2.76494932 1.88207424
H  -1.02354275 1.51892916 2.60636706
