program: Gaussian 16
title: Title Card Required
version: ES64L-G16RevA.03
frameworkgroup: C1[X(C14H25Cl2N3Pd)]
method: RMN15
basis: def2SVP
operation: Freq
keyword: #N
keyword: Geom=AllCheck
keyword: Guess=TCheck
keyword: SCRF=Check
keyword: GenChk
keyword: RMN15/def2SVP
keyword: Freq
converged: YES YES NO NO
title: Mulliken charges:
elementType: C C C C C C H H H H H H H H C H C H Pd Cl Cl C N N C H H H C H H H N C H H H C H H H C H H H
charge: 0.083474 0.179492 0.003531 -0.148970 -0.016212 0.131159 -0.012750 -0.028215 0.027692 0.028004 0.036612 0.021089 0.080626 -0.003623 -0.012987 0.004111 -0.057705 0.019069 -0.127530 -0.298727 -0.337919 -0.275791 0.198919 -0.266138 0.113820 0.060948 0.028630 0.036266 0.107554 0.029979 0.048459 0.059364 -0.339587 0.119308 0.019248 -0.018422 0.012477 0.119858 -0.010830 0.014383 0.042582 0.085731 0.080107 0.082191 0.080724
chargesum: -0.00000
title: Mulliken charges with hydrogens summed into heavy atoms:
elementType: C C C C C C C C Pd Cl Cl C N N C C N C C C
charge: 0.070724 0.187889 0.003531 -0.121278 0.032881 0.208162 -0.008875 -0.038635 -0.127530 -0.298727 -0.337919 -0.275791 0.198919 -0.266138 0.239665 0.245355 -0.339587 0.132611 0.165993 0.328753
1716.lowfreq: -498.2673 -5.5475 -0.0015 -0.0013 0.0017 2.4461 3.7567 6.1994 25.0914
frequency: -498.2673 4.4878 25.0614 29.3386 32.5885 51.6509 66.9273 77.9674 94.0636 102.2451 104.9930 113.6615 120.1917 140.0703 154.2180 163.4432 185.0753 199.6451 202.8018 214.1776 230.5656 239.7135 250.6515 268.2224 278.4120 290.3907 308.5279 314.5986 341.6818 349.4864 370.8338 384.8847 417.2051 420.2259 426.3777 435.9383 442.0917 479.2536 483.6852 512.2625 534.2850 598.2439 628.1859 703.4822 731.7166 764.3633 800.2460 822.3584 839.5484 879.3212 911.6313 955.1469 964.8877 974.1247 980.3771 1002.4453 1024.5738 1025.6795 1026.9365 1042.9205 1055.0381 1060.3498 1064.5525 1085.1342 1094.8035 1106.8894 1119.5337 1134.0784 1147.6125 1160.2932 1194.7772 1204.3220 1204.6914 1222.8532 1257.2072 1269.7777 1277.2810 1306.2607 1313.4834 1332.6516 1367.4033 1370.5498 1384.2495 1397.6304 1407.9924 1410.1872 1419.4874 1419.8058 1420.9137 1429.3276 1432.2244 1438.0747 1444.4813 1446.7143 1450.1608 1451.2851 1457.8022 1467.8561 1471.3759 1481.3249 1521.6669 1618.1159 1749.0935 2465.1086 2882.9472 2954.3893 2962.6579 3059.9920 3063.9711 3100.2199 3119.4789 3129.1017 3131.0549 3141.8362 3157.2102 3162.5837 3173.8256 3182.0669 3189.6135 3192.2284 3193.8052 3194.1989 3209.1716 3211.0184 3222.1794 3223.2528 3228.1072 3293.5157 3322.9451
redmass: 8.1215 1.0151 4.8600 4.0525 7.6481 3.4963 2.7307 4.4804 3.5157 8.2153 4.7850 1.5709 3.0563 3.5719 4.1142 7.0154 3.4700 1.4119 5.3105 2.6549 1.2915 4.1545 7.2623 3.2225 1.3107 11.6258 3.1870 2.9781 2.5912 3.2529 6.7172 3.0803 2.3912 2.9812 3.7991 2.5939 4.6725 2.1128 2.1717 2.8627 2.9673 3.3790 3.6962 2.9367 1.5135 1.5141 1.1965 2.9245 1.4869 1.5951 1.9192 1.8260 2.0608 2.5468 3.6618 1.3854 1.4723 1.4760 1.2566 1.5808 1.3739 1.4338 1.3274 1.5103 1.2330 1.6666 1.3742 1.2840 1.4115 1.6045 1.3852 1.6171 1.5270 1.2826 1.6202 1.8099 3.3896 2.5641 1.4593 1.6844 1.5164 1.3114 1.3123 1.5071 1.2100 1.2238 1.0363 1.0365 1.2888 1.0913 1.1381 1.0619 1.1262 1.0815 1.0444 1.0681 1.0643 1.0879 1.1175 2.1969 2.8015 4.4107 8.6283 12.6217 1.0783 1.0596 1.0599 1.0392 1.0402 1.0355 1.0650 1.0762 1.0775 1.1054 1.1045 1.0936 1.0962 1.1029 1.0606 1.0864 1.0595 1.1022 1.1050 1.1054 1.1005 1.1006 1.0938 1.1157 1.1153
irintensity: 1488.0642 0.0282 3.6014 6.4895 2.4735 0.4792 0.3099 3.5660 2.6320 3.8461 3.0899 0.6576 1.2969 4.6135 4.2310 3.0729 0.5461 0.1812 0.5809 0.3382 0.2773 7.0045 6.0478 10.0387 1.5256 8.5803 14.1716 5.1181 8.0712 14.4148 22.7173 9.3552 0.3913 1.5603 0.7209 0.3337 0.0938 2.5185 1.9317 1.2396 1.2526 7.3598 70.3121 13.5041 28.0819 6.3494 74.2870 4.0282 123.8604 51.2744 0.7181 9.9175 13.3271 3.4545 0.6384 2.6224 3.4821 4.2380 62.7842 20.0797 0.7466 18.0112 6.1996 4.0548 0.3274 3.8123 64.7199 25.1544 0.5333 12.8589 6.7212 20.1978 14.0541 8.6864 37.0639 6.4640 14.2853 20.2854 2.3361 13.8389 31.7891 0.0527 3.0382 7.8562 3.0811 11.9327 12.9613 12.5374 16.2707 1.5346 12.3682 7.5010 3.7621 5.0917 9.1425 16.9970 26.0422 4.7951 21.2454 48.4533 53.5706 472.1582 15.2997 15.4262 39.1827 53.6264 73.1498 30.1776 79.8586 0.2143 1.4968 25.9841 39.4814 14.5940 3.9831 3.1550 5.9168 24.1806 6.6392 0.3951 11.4629 14.7549 0.7955 0.7643 3.3736 3.1647 13.2950 3.4856 4.6196
temp: 298.150 k
press: 1.00000 atm
elementType: 6 6 6 6 6 6 1 1 1 1 1 1 1 1 6 1 6 1 46 17 17 6 7 7 6 1 1 1 6 1 1 1 7 6 1 1 1 6 1 1 1 6 1 1 1
symmnumber: 1
zpe: 985566.7 jmol-1
zpe.correction: 0.375383 hartree
zpe.thermalcorrener: 0.401114 hartree
zpe.thermalcorrenthalpy: 0.402058 hartree
zpe.thermalcorrgfe: 0.315922 hartree
zpe.sumelectzpe: -1758.371707 hartree
zpe.sumelectthermal: -1758.345976 hartree
zpe.sumelectthermalent: -1758.345031 hartree
zpe.sumelectthermalfe: -1758.431167 hartree
dipole: -0.6642 4.5948 -0.8640
dipole: 4.7223
quadrupole: -100.2532 -144.1941 -154.1847
quadrupole: 2.5334 -10.7524 8.3136
quadrupole: 32.6242 -11.3168 -21.3074 2.5334 -10.7524 8.3136
hfenergy: -1758.7470896 hartree
pointgroup: C01 [X(C14H25Cl2N3Pd1)]
dipole: -0.2596572 1.813392 -0.3098281 debye
polarizability: 330.8088728|-27.5055855|259.1031795|-6.9632223|-7.0457292|181.3731554 unknown
InChI: InChI=1S/C12H22N2.C2H3N.2ClH.Pd/c1-7-8-12(14(5)6)10-9-11(2)13(3)4;1-2-3;;;/h7,9-10,12H,1-2,8H2,3-6H3;1H3;2*1H;/q;;;;+2/p-2
charge 0 multiplicity 1
45 atoms
C  -2.6311808 -1.22911257 -0.34607039
C  -1.24366632 -0.63786311 -0.703507
C  -2.68957698 1.66005534 0.74766849
C  -0.33982076 -0.71222497 0.50543378
C  -2.31105174 1.04537398 1.94869034
C  -0.35619903 0.38877463 1.4183062
H  -2.62753354 -1.42712511 0.75683926
H  -1.32120157 0.40761247 -1.03339116
H  -0.32693741 -1.70135178 0.98133969
H  -2.92031736 0.20238817 2.27992387
H  -0.8335692 -1.18066735 -1.56744554
H  -1.85728364 1.63293822 2.74787422
H  0.02524092 0.22726153 2.43129969
H  -0.21338919 1.38134537 0.99507301
C  -3.725545 -0.21769855 -0.59152539
H  -4.56478793 -0.5197932 -1.22405596
C  -3.72934944 1.03475004 -0.11487725
H  -4.55665088 1.69981691 -0.38605833
Pd 1.64255788 -0.26000636 0.11882797
Cl 2.20089463 -2.07053275 1.41938847
Cl 1.06331274 1.65885681 -1.13951701
C  4.75522155 0.1824229 -0.66095547
N  3.64808446 0.05133719 -0.36615819
N  -2.14208268 2.8016772 0.28004044
C  -1.23816724 3.64320782 1.04537731
H  -0.2069382 3.52483669 0.67117659
H  -1.53667135 4.69610098 0.91932434
H  -1.27368999 3.40263987 2.11301944
C  -2.26806917 3.23129189 -1.10462908
H  -2.80319287 4.19331731 -1.17058378
H  -1.25798214 3.34400189 -1.52698488
H  -2.79471482 2.47720098 -1.69911358
N  -2.88519812 -2.49854869 -1.0243398
C  -4.15303474 -3.0819496 -0.63301058
H  -4.293854 -4.04106441 -1.1522867
H  -4.19915815 -3.28144267 0.46274454
H  -5.00687447 -2.44219119 -0.8925581
C  -1.83937497 -3.4663347 -0.74229786
H  -1.79010019 -3.71554114 0.34263439
H  -2.03951665 -4.39729407 -1.29229421
H  -0.84707506 -3.10596227 -1.04211553
C  6.15253393 0.34287562 -1.03109465
H  6.73634082 0.65885637 -0.15645099
H  6.55179468 -0.6114008 -1.39962642
H  6.24714298 1.10110109 -1.81945321
