program: Gaussian 16
title: min nm2166_B irc ( for irc NM1549 (sub 2.17 from nm1243 for ts (from scan nm1140 freeze 1 2 at 2.2 and scan 5 6 (took nm1128.com and changed both to p(ch3)2))))
version: ES64L-G16RevC.01
frameworkgroup: C1[X(C12H19Cl2NO2Pd)]
method: RMN15
basis: def2SVP
operation: Freq
keyword: #N
keyword: Geom=AllCheck
keyword: Guess=TCheck
keyword: SCRF=Check
keyword: GenChk
keyword: RMN15/def2SVPFreq
keyword: RMN15/def2SVP
keyword: Freq
title: min nm2166_B irc ( for irc NM1549 (sub 2.17 from nm1243 for ts (from s
converged: YES YES YES YES
title: Mulliken charges:
elementType: C C C C C C H H H H H H H C H C H Pd Cl Cl C N C H H H H O O C H H H C H H H
charge: 0.112715 0.025737 0.046104 -0.135373 0.086071 0.130957 0.021200 0.070986 0.015013 0.011555 0.022452 0.025808 0.017037 0.024532 0.046915 -0.024565 -0.010639 -0.084489 -0.329972 -0.354689 -0.281337 0.198307 0.086079 0.078452 0.079347 0.081052 0.072375 -0.315772 -0.253128 0.165748 0.014337 0.042340 0.025643 0.147780 0.054667 0.049110 0.037645
chargesum: 0.00000
title: Mulliken charges with hydrogens summed into heavy atoms:
elementType: C C C C C C C C Pd Cl Cl C N C O O C C
charge: 0.133915 0.169097 0.046104 -0.120360 0.120078 0.173803 0.071446 -0.035204 -0.084489 -0.329972 -0.354689 -0.281337 0.198307 0.324929 -0.315772 -0.253128 0.248069 0.289201
chargesum: -0.00000
1716.lowfreq: -486.8593 -7.7790 -4.9883 -1.6994 0.0012 0.0026 0.0030 15.7474 25.1487
frequency: -486.8593 15.7213 25.1261 29.1311 40.8338 47.3983 83.5163 99.3841 106.2297 109.8595 116.7196 145.3965 164.3213 170.3150 190.9109 200.6969 216.0552 227.3247 241.4709 248.6792 254.6296 258.8522 277.4712 291.8496 322.9739 325.0227 340.5871 369.7147 390.7052 417.0009 427.6207 439.9675 454.1603 464.6393 531.7484 633.4007 683.0035 709.8084 777.5796 808.0028 834.7464 875.3416 930.4479 940.3442 964.9627 979.0828 981.4705 1024.9878 1025.4524 1029.0459 1046.0395 1064.9546 1077.5287 1116.4759 1125.1162 1153.9660 1164.5335 1174.5452 1182.9187 1187.2633 1196.8799 1218.3043 1249.1780 1262.9671 1288.2161 1310.8835 1324.1754 1337.3761 1370.7010 1381.2078 1383.9299 1414.1393 1419.9055 1420.4074 1425.3158 1435.7067 1441.4310 1447.2676 1453.0978 1462.6304 1465.3991 1483.3385 1492.3065 1625.3428 1636.1648 2462.3968 3036.4824 3067.2170 3099.8720 3103.8841 3106.2887 3118.0759 3126.1968 3150.8510 3161.4275 3169.8696 3170.2543 3189.7119 3201.3754 3208.8822 3209.8727 3210.8472 3225.5365 3253.4608 3262.2579
redmass: 9.5968 1.0157 4.1939 4.7750 6.3418 10.5596 4.1440 7.8921 5.8633 3.6326 4.0544 7.9316 6.6642 3.9239 3.5041 5.6582 1.6918 2.6367 3.6746 1.6387 3.8095 3.0428 3.1077 6.1146 4.9257 3.3942 4.9815 5.2681 2.8043 2.9842 3.9457 4.4638 3.5025 2.3516 2.9271 3.2034 2.7841 3.9274 2.3770 2.1319 1.4235 1.8049 1.4197 2.0272 1.4612 3.5381 1.2957 1.4779 1.4758 1.9746 1.6203 2.4095 1.4934 2.4017 1.9380 1.3183 1.3038 1.3002 1.2742 1.3717 1.3180 1.7958 1.3617 1.3553 3.0095 1.3715 1.3283 1.3918 1.3115 1.7092 1.7134 1.5519 1.0362 1.0365 1.4148 1.1196 1.1165 1.0974 1.0913 1.1011 1.0644 1.1207 2.1539 5.5527 4.3398 12.6177 1.0379 1.0345 1.0355 1.0624 1.0625 1.1069 1.0871 1.0599 1.1048 1.1079 1.1047 1.0902 1.0868 1.1050 1.1053 1.1016 1.1042 1.0899 1.1119
irintensity: 1377.6235 0.0452 3.3136 7.2234 6.4313 1.5983 4.1883 2.7753 8.8492 1.0839 1.7428 2.3239 7.1749 9.3250 0.8284 0.7520 4.9703 5.1690 6.8361 5.2344 1.1109 2.7935 9.3382 4.0339 9.4083 12.0436 43.8157 6.4673 6.1382 2.1462 0.5798 0.4724 1.8739 18.2349 0.1707 27.6502 8.0474 14.7911 10.2677 6.7487 52.1843 28.2531 46.0763 26.2274 78.0437 2.9324 62.2839 5.1873 4.9483 1.7969 1.2868 48.8275 20.5557 19.4075 26.9741 45.7631 20.1093 4.1205 23.2796 63.8036 14.3525 9.7340 51.1377 22.1428 379.5488 12.6467 82.4930 5.0956 0.3165 13.3363 15.1126 82.4977 12.4079 12.5251 4.5573 2.1750 12.2585 6.4559 4.4515 12.1542 14.8387 18.3294 77.7311 663.3975 123.8516 9.1575 45.7609 51.6551 0.4805 8.8182 31.5528 19.2778 10.3072 4.4761 8.6846 8.0532 5.1436 5.6411 5.9363 0.5343 0.6637 15.3360 7.6812 5.2140 4.8810
temp: 298.150 k
press: 1.00000 atm
elementType: 6 6 6 6 6 6 1 1 1 1 1 1 1 6 1 6 1 46 17 17 6 7 6 1 1 1 1 8 8 6 1 1 1 6 1 1 1
symmnumber: 1
zpe: 777680.9 jmol-1
zpe.correction: 0.296203 hartree
zpe.thermalcorrener: 0.318723 hartree
zpe.thermalcorrenthalpy: 0.319667 hartree
zpe.thermalcorrgfe: 0.241376 hartree
zpe.sumelectzpe: -1719.688765 hartree
zpe.sumelectthermal: -1719.666245 hartree
zpe.sumelectthermalent: -1719.665301 hartree
zpe.sumelectthermalfe: -1719.743592 hartree
dipole: 2.0210 -2.2833 -2.1463
dipole: 3.7289
quadrupole: -88.5033 -133.3866 -133.6404
quadrupole: 9.6648 7.7046 1.4454
quadrupole: 30.0068 -14.8765 -15.1303 9.6648 7.7046 1.4454
hfenergy: -1719.9849683 hartree
pointgroup: C01 [X(C12H19Cl2N1O2Pd1)]
dipole: 0.7867167 -0.7048825 -1.018064 debye
polarizability: 306.8146812|-13.2658543|224.6745741|-10.4502219|16.7878706|158.3807103 unknown
InChI: InChI=1S/C10H16O2.C2H3N.2ClH.Pd/c1-11-9-5-3-4-6-10(12-2)8-7-9;1-2-3;;;/h3,7-9H,4-6H2,1-2H3;1H3;2*1H;/q;;;;+2/p-2
charge 0 multiplicity 1
37 atoms
C  2.81542617 1.83597217 -0.1404611
C  1.16342428 0.96127893 -0.34644363
C  3.45121676 -1.246944 0.1274256
C  0.79348837 0.41199899 0.96353415
C  3.04121415 -0.82023696 1.50733559
C  1.50620159 -0.78685052 1.60145296
H  2.91817891 1.71292265 0.94281575
H  1.24799565 0.23512701 -1.15910877
H  0.66602165 1.22809038 1.69008809
H  3.52315014 0.12480233 1.79578143
H  3.42209307 -1.59947834 2.18434984
H  1.22088793 -0.80795274 2.66353466
H  1.13839452 -1.72126506 1.15395186
C  3.44126082 0.95999398 -1.03913176
H  3.55845364 1.40349751 -2.03556552
C  3.71026575 -0.42955484 -0.95327334
H  4.01026779 -0.90253506 -1.88856666
Pd -1.08276297 -0.02638848 0.28738649
Cl -1.7283047 1.99768337 1.22191305
Cl -0.22867243 -1.89274525 -0.8920248
C  -4.10867123 -0.71064309 -0.67343453
N  -3.02928575 -0.46621203 -0.34832927
C  -5.47089913 -1.01611058 -1.08214348
H  -5.65546105 -0.62239304 -2.09044968
H  -5.62500894 -2.10321558 -1.08978857
H  -6.18268795 -0.55661274 -0.38366805
H  0.61336394 1.86659743 -0.63434796
O  2.69142852 3.13411039 -0.53501847
O  3.47714109 -2.56511543 0.04145831
C  1.97031976 3.94082168 0.37241423
H  2.48832056 3.99628692 1.34680013
H  1.91023676 4.94824988 -0.05514614
H  0.94680869 3.55931828 0.54311487
C  3.42049008 -3.21212604 -1.21662987
H  3.31242093 -4.28228495 -1.01044326
H  2.53857706 -2.84814957 -1.76805827
H  4.34053257 -3.0471126 -1.79859789
