program: Gaussian 16
title: Reopt DREAM596_imbeggingyou
version: ES64L-G16RevA.03
frameworkgroup: C1[X(C10H15Cl2NPd)]
method: RMN15
basis: def2SVP
operation: Freq
keyword: #N
keyword: Geom=AllCheck
keyword: Guess=TCheck
keyword: SCRF=Check
keyword: GenChk
keyword: RMN15/def2SVP
keyword: Freq
converged: YES YES NO NO
title: Mulliken charges:
elementType: C C C C C C H H H H H H H H H H C H C H Pd Cl Cl C N C H H H
charge: 0.075238 0.119171 -0.013445 -0.139433 -0.019830 0.134466 0.009773 0.014007 0.066533 0.015372 0.016515 0.035539 -0.013302 0.025233 0.085683 0.067952 -0.095371 0.002419 0.031264 -0.017595 -0.125442 -0.278331 -0.282369 -0.249256 0.183595 0.083123 0.090490 0.089884 0.088118
chargesum: -0.00000
title: Mulliken charges with hydrogens summed into heavy atoms:
elementType: C C C C C C C C Pd Cl Cl C N C
charge: 0.101526 0.168717 -0.026748 -0.072900 0.020775 0.288100 -0.092952 0.013670 -0.125442 -0.278331 -0.282369 -0.249256 0.183595 0.351615
1716.lowfreq: -0.0027 0.0017 0.0023 0.7014 1.3003 5.9948 7.5529 20.4319 27.1065
frequency: 7.4415 20.4256 27.0776 35.8884 41.1520 69.1168 101.4513 108.6701 116.0196 138.2903 156.6065 165.3695 178.6622 193.6469 228.0498 253.0532 261.9318 274.6021 326.5857 372.3544 383.8535 390.0276 411.6373 422.9882 447.3682 452.4992 530.4131 604.5157 679.3074 754.6589 813.1428 833.2263 871.8572 917.1202 952.1405 964.2210 978.9879 982.7130 993.4411 1011.1904 1023.6132 1024.0256 1024.3768 1038.4387 1045.0928 1084.1861 1165.4666 1202.1326 1218.4372 1252.5353 1272.3396 1285.3351 1311.4526 1321.4953 1369.4207 1370.0312 1391.9346 1415.7558 1416.7285 1435.3234 1441.0293 1451.4296 1595.8960 1691.2965 1756.8787 2475.2825 3089.3620 3100.6755 3101.0079 3142.5614 3169.5703 3176.4338 3178.5396 3183.5294 3194.5639 3200.7218 3205.2698 3211.9853 3213.6718 3288.4853 3296.1455
redmass: 1.0244 5.1345 4.4669 4.9724 5.0693 4.2671 5.2718 5.5278 5.3850 2.2797 7.6561 5.9911 4.6515 5.8892 5.1703 2.3361 3.2117 8.4727 31.1681 2.8135 10.2242 3.5116 2.3322 3.9478 4.7016 1.9338 2.2708 2.6234 1.5057 1.1979 1.5038 1.9906 1.6573 1.5518 1.3126 1.5053 1.5386 2.1779 1.7840 1.3436 1.4834 1.4844 1.4863 1.8059 1.1745 1.3173 1.7521 1.3368 1.3774 1.1747 1.2545 1.2966 1.4022 1.3395 1.3107 1.3017 1.2092 1.0359 1.0364 1.2478 1.1918 1.2806 3.9039 5.6077 6.6600 12.6423 1.0617 1.0637 1.0353 1.1046 1.1037 1.0570 1.0610 1.0860 1.0917 1.0940 1.0952 1.1051 1.1056 1.1171 1.1202
irintensity: 0.0701 1.6576 3.5424 2.4607 5.1736 1.6667 0.5146 0.2105 3.2051 0.3575 5.2711 1.4973 0.6626 3.8397 5.0053 2.5147 2.7916 2.2632 0.6045 2.9337 49.3754 3.7624 1.4793 0.2390 0.1382 2.3884 15.3675 4.2973 16.9737 1.4559 12.0913 2.0337 2.3883 2.2677 44.2831 0.0830 34.2088 0.4889 3.6395 1.6783 5.6375 5.9808 4.2667 3.7902 6.8611 1.4145 3.6207 5.7268 1.3160 3.1363 1.1408 2.5443 5.7024 5.4889 0.1701 1.7656 8.3780 13.7914 14.0316 10.7675 12.3214 3.7601 20.3788 1.4392 2.6338 41.6061 20.8144 14.7485 0.6534 12.2287 7.6758 0.5087 6.7376 1.8805 0.4777 0.8171 25.8518 2.2452 2.4260 6.9567 0.5641
temp: 298.150 k
press: 1.00000 atm
elementType: 6 6 6 6 6 6 1 1 1 1 1 1 1 1 1 1 6 1 6 1 46 17 17 6 7 6 1 1 1
symmnumber: 1
zpe: 599952.1 jmol-1
zpe.correction: 0.228510 hartree
zpe.thermalcorrener: 0.247637 hartree
zpe.thermalcorrenthalpy: 0.248581 hartree
zpe.thermalcorrgfe: 0.175600 hartree
zpe.sumelectzpe: -1491.184866 hartree
zpe.sumelectthermal: -1491.165739 hartree
zpe.sumelectthermalent: -1491.164795 hartree
zpe.sumelectthermalfe: -1491.237776 hartree
dipole: 4.2914 -0.3766 0.8781
dipole: 4.3964
quadrupole: -64.9642 -124.2528 -110.7602
quadrupole: 1.4192 3.0949 -4.7244
quadrupole: 35.0282 -24.2604 -10.7678 1.4192 3.0949 -4.7244
hfenergy: -1491.4133761 hartree
pointgroup: C01 [X(C10H15Cl2N1Pd1)]
dipole: 1.6852861 -0.1147835 0.372106 debye
polarizability: 217.7321619|-12.6055333|180.3903582|16.7275048|-14.8773598|130.8538815 unknown
InChI: InChI=1S/C8H12.C2H3N.2ClH.Pd/c1-3-5-7-8-6-4-2;1-2-3;;;/h3-5,7H,1-2,6,8H2;1H3;2*1H;/q;;;;+2/p-2
charge 0 multiplicity 1
29 atoms
C  -3.11036322 -0.98279955 1.67897353
C  -1.59285841 -1.04207726 1.39251001
C  -4.51103938 1.0015666 -0.26838457
C  -1.19965135 0.10926812 0.51585591
C  -5.1112219 1.81305769 -1.15253784
C  -1.10163819 0.05023195 -0.86364782
H  -3.37332513 0.0113548 2.0737565
H  -1.32470834 -1.99093288 0.90611233
H  -1.24533678 1.10700573 0.96938316
H  -5.65361632 1.40662577 -2.01198682
H  -3.33294101 -1.70488304 2.47996012
H  -1.03859027 -0.98787452 2.34246802
H  -3.9726783 1.44536618 0.57614483
H  -5.07910532 2.89947239 -1.04857558
H  -1.11598931 0.97189839 -1.45161114
H  -1.22813688 -0.90523224 -1.38049691
C  -3.92560141 -1.32255103 0.46566179
H  -3.99735925 -2.39029401 0.22973714
C  -4.52092461 -0.45597558 -0.37626117
H  -5.0646369 -0.86123963 -1.23731591
Pd 0.91312691 0.05175344 -0.10098515
Cl 0.89033782 2.34433922 0.09001328
Cl 0.9802867 -2.23408719 -0.38174265
C  4.1012109 0.05684372 0.09322269
N  2.95039794 0.06041415 0.03603253
C  5.55235498 0.05196631 0.16437684
H  5.94409024 -0.8624415 -0.30035218
H  5.95295318 0.92823995 -0.36218533
H  5.87099263 0.08737301 1.2146364
