program: Gaussian 16
title: Title Card Required
version: ES64L-G16RevC.01
frameworkgroup: C1[X(C10H17Cl2N3Pd)]
method: RMN15
basis: def2SVP
operation: Freq
keyword: #N
keyword: Geom=AllCheck
keyword: Guess=TCheck
keyword: SCRF=Check
keyword: GenChk
keyword: RMN15/def2SVP
keyword: Freq
converged: YES YES NO NO
title: Mulliken charges:
elementType: C C C C C C H H H H H H H H C H C H Pd Cl Cl C N C H H H N H H N H H
charge: -0.027676 0.065759 -0.154516 -0.106583 0.137510 0.090114 -0.010435 0.036931 0.033275 -0.007043 0.013780 0.020776 0.021835 0.015401 -0.027994 -0.006542 -0.023332 -0.044397 -0.081527 -0.312374 -0.313105 -0.263690 0.190323 0.084430 0.086170 0.087171 0.084410 -0.000104 0.133127 0.150258 -0.079246 0.107064 0.100232
chargesum: -0.00000
title: Mulliken charges with hydrogens summed into heavy atoms:
elementType: C C C C C C C C Pd Cl Cl C N C N N
charge: -0.024331 0.102690 -0.154516 -0.073307 0.151243 0.127350 -0.034536 -0.067730 -0.081527 -0.312374 -0.313105 -0.263690 0.190323 0.342180 0.283281 0.128049
1716.lowfreq: -4.3222 -3.3841 -0.0013 0.0005 0.0010 2.8201 16.1172 29.0379 30.6241
frequency: 16.0846 29.0365 30.6217 48.9134 59.5489 71.9822 99.6845 106.3681 123.4130 134.8026 150.8279 158.0930 160.6008 192.1614 213.6455 220.6022 242.0990 261.3914 262.8257 280.8541 307.0271 330.1496 339.3831 361.9581 384.3625 406.5816 426.1433 446.2251 447.1621 475.5900 515.9516 564.1515 597.9333 605.4068 630.5690 637.7316 689.3639 781.1814 861.1741 889.7824 915.1104 925.9075 936.3779 980.9431 983.7108 1008.8190 1020.3006 1024.1242 1024.5817 1028.3379 1033.7752 1056.4283 1099.3624 1135.9588 1187.7964 1212.6328 1277.7788 1296.0825 1306.5941 1318.0139 1334.3547 1340.3078 1362.9912 1369.9908 1400.3650 1417.3741 1418.2772 1424.8731 1440.0693 1452.1420 1556.8964 1595.2930 1653.6129 1709.6074 1727.1984 2469.1740 3084.1135 3100.4709 3116.5808 3149.0315 3162.8527 3164.7775 3173.7983 3182.2980 3186.4824 3210.7055 3211.9624 3250.1809 3283.2795 3542.7394 3553.2224 3677.7679 3717.9039
redmass: 1.0125 4.6000 4.3396 5.5683 5.4386 5.6332 4.7798 12.4492 5.5229 2.8314 5.9834 4.8877 13.7587 6.6985 5.7705 3.6950 2.2083 4.2225 5.2921 4.1770 21.1664 2.0019 2.9451 2.8508 4.1357 1.2222 4.0296 4.7348 1.9731 1.6894 2.4867 1.6940 1.4892 1.8696 1.5568 2.0968 1.9170 2.5508 1.4957 1.8884 1.8986 1.4096 1.4881 2.2895 2.4411 1.5793 1.4979 1.4823 1.4802 1.1636 1.4266 1.4429 1.2642 1.3102 1.3043 1.5638 1.3095 1.2169 1.7097 1.3426 1.8785 1.9843 1.4529 1.3111 1.4148 1.0360 1.0363 1.2777 1.3458 1.3231 1.4145 1.2106 2.7935 5.2725 7.1210 12.6317 1.0684 1.0354 1.0644 1.0862 1.0982 1.0834 1.0934 1.0788 1.0873 1.1051 1.1055 1.0926 1.1168 1.0534 1.0518 1.0964 1.0970
irintensity: 0.0076 4.7719 3.5791 4.6739 0.8604 2.5288 2.0848 0.7008 2.3271 3.2553 6.6652 20.2378 3.2163 10.9770 2.9937 1.0650 6.5135 3.9473 2.1232 0.0952 6.4111 15.0971 56.7609 4.0645 38.8455 37.3645 4.1940 0.0376 6.6001 83.2087 14.6291 173.0305 144.2987 16.3519 183.7807 99.6315 7.6970 2.6600 23.4609 5.1713 8.3926 26.5621 43.0802 5.9082 5.7669 9.8180 0.4840 6.1830 5.4445 14.3882 4.7228 0.5921 3.2623 4.0965 4.2467 0.9047 15.7646 7.7430 20.2123 3.8147 2.3500 31.0956 10.3055 0.1225 17.6503 13.2089 13.4981 4.2451 16.8551 9.3198 33.2280 45.0822 237.8053 20.4731 204.1194 26.3256 22.7228 0.0750 23.9853 23.7634 9.1540 37.9828 0.7563 0.8224 7.6163 1.4648 1.6346 0.4079 17.1954 69.9591 83.6527 41.0117 84.3188
temp: 298.150 k
press: 1.00000 atm
elementType: 6 6 6 6 6 6 1 1 1 1 1 1 1 1 6 1 6 1 46 17 17 6 7 6 1 1 1 7 1 1 7 1 1
symmnumber: 1
zpe: 692486.6 jmol-1
zpe.correction: 0.263754 hartree
zpe.thermalcorrener: 0.285125 hartree
zpe.thermalcorrenthalpy: 0.286069 hartree
zpe.thermalcorrgfe: 0.210816 hartree
zpe.sumelectzpe: -1601.673277 hartree
zpe.sumelectthermal: -1601.651906 hartree
zpe.sumelectthermalent: -1601.650962 hartree
zpe.sumelectthermalfe: -1601.726215 hartree
dipole: -4.6517 -0.5544 -2.9552
dipole: 5.5388
quadrupole: -87.1139 -134.9314 -116.2998
quadrupole: 7.9310 0.2113 -2.8449
quadrupole: 25.6678 -22.1497 -3.5181 7.9310 0.2113 -2.8449
hfenergy: -1601.9370311 hartree
pointgroup: C01 [X(C10H17Cl2N3Pd1)]
dipole: -1.8299924 -0.219261 -1.1626194 debye
polarizability: 250.4729523|16.0717855|191.49223|-11.6259059|0.8885798|137.3748732 unknown
InChI: InChI=1S/C8H14N2.C2H3N.2ClH.Pd/c1-2-5-8(10)6-3-4-7-9;1-2-3;;;/h2,4-5,7H,1,3,6,9-10H2;1H3;2*1H;/q;;;;+2/p-2
charge 0 multiplicity 1
33 atoms
C  4.25594384 1.92677786 0.02935083
C  0.96372137 0.41618904 -0.76254749
C  3.30709857 -1.16639337 0.05480645
C  0.81327631 0.49434782 0.64270351
C  2.90275291 -0.73447928 1.43897844
C  1.38192759 -0.55021155 1.58361924
H  3.22325363 1.95617645 0.38823852
H  1.13988496 -0.55701651 -1.22935823
H  0.81697558 1.52116071 1.02973682
H  3.44237584 0.18051033 1.71331596
H  4.84630788 2.83968186 0.13814776
H  3.21710067 -1.52900517 2.13690177
H  1.14798561 -0.2483991 2.61489502
H  0.87470235 -1.51273208 1.43164538
C  4.78181201 0.82813136 -0.53996428
H  5.80176257 0.9124503 -0.93793253
C  4.14458284 -0.4711538 -0.76137533
H  4.4226732 -0.96985346 -1.69990705
Pd -1.19742215 0.11620243 0.13812582
Cl -1.52444287 2.4022251 0.35194147
Cl -0.81898495 -2.15167443 -0.27118215
C  -4.35659297 -0.35294255 -0.21726041
N  -3.22000209 -0.1861338 -0.12049619
C  -5.79018962 -0.56187363 -0.33780712
H  -6.12514171 -1.28419285 0.4183957
H  -6.31942092 0.38847428 -0.1883114
H  -6.0269639 -0.95374628 -1.33585212
N  0.96708218 1.48487819 -1.57035958
H  0.61379278 2.36335754 -1.18533188
H  0.88962869 1.35775734 -2.57325572
N  2.78991326 -2.39906729 -0.31280752
H  2.93450116 -2.67689977 -1.27966272
H  1.85203936 -2.62464569 0.02163004
