program: Gaussian 16
title: Title Card Required
version: ES64L-G16RevA.03
frameworkgroup: C1[X(C14H25Cl2N3Pd)]
method: RMN15
basis: def2SVP
operation: Freq
keyword: #N
keyword: Geom=AllCheck
keyword: Guess=TCheck
keyword: SCRF=Check
keyword: GenChk
keyword: RMN15/def2SVP
keyword: Freq
converged: YES YES YES YES
title: Mulliken charges:
elementType: C C C C C C H H H H H H H H C H C H Pd Cl Cl C N N C H H H C H H H N C H H H C H H H C H H H
charge: 0.012542 0.097860 0.010106 -0.152813 0.034684 0.168915 0.000577 0.070799 0.030206 0.012243 0.071795 0.012003 0.012846 0.002084 -0.009579 0.017237 -0.020647 -0.037764 -0.096752 -0.316897 -0.347558 -0.278513 0.197567 -0.248516 0.093995 0.052635 0.031142 0.038241 0.115858 0.041741 0.028675 0.045749 -0.319503 0.130661 0.020143 -0.012752 0.016497 0.120322 -0.012723 0.018027 0.021976 0.085663 0.078771 0.083121 0.079335
chargesum: -0.00000
title: Mulliken charges with hydrogens summed into heavy atoms:
elementType: C C C C C C C C Pd Cl Cl C N N C C N C C C
charge: 0.013120 0.240454 0.010106 -0.122607 0.058929 0.183845 0.007659 -0.058411 -0.096752 -0.316897 -0.347558 -0.278513 0.197567 -0.248516 0.216013 0.232022 -0.319503 0.154549 0.147602 0.326891
chargesum: 0.00000
1716.lowfreq: -517.0873 -4.4891 -0.0022 -0.0010 -0.0007 3.2387 3.9594 18.8873 27.4524
frequency: -517.0873 18.8682 27.4466 28.7665 45.0486 58.3384 67.7434 77.0852 100.1205 102.0643 111.3447 117.2560 136.4978 155.1121 165.8530 183.9521 201.1818 206.4330 213.0450 216.4646 233.9343 236.3546 243.5480 250.6725 270.7128 274.6557 289.9748 295.7094 310.1542 342.0909 355.4284 372.8004 403.0747 419.3504 423.7048 432.8015 442.0243 448.1708 475.7575 484.2328 520.1348 601.4343 665.4591 679.8934 735.0297 806.9419 809.7285 851.7144 884.0338 888.9144 928.3164 948.8097 976.9308 979.4443 987.8254 1024.9488 1025.3969 1030.2900 1039.2433 1063.4945 1070.5405 1075.5703 1077.4813 1090.8185 1102.0181 1115.5983 1135.4262 1144.0116 1154.4213 1159.7354 1210.8862 1238.7707 1254.7277 1260.5141 1266.1092 1290.2996 1325.9548 1336.0796 1343.5892 1347.1124 1370.5190 1378.2691 1399.0345 1405.5749 1412.9432 1415.2078 1419.3950 1420.3022 1423.0093 1435.8907 1441.2012 1442.6534 1445.4222 1447.9698 1457.7491 1458.4348 1460.2958 1464.1398 1476.3966 1484.6345 1536.7720 1602.8448 1635.0698 2463.1581 2971.6101 2983.9157 3054.4608 3061.2458 3099.9546 3100.4332 3108.2801 3120.0648 3123.8859 3152.1312 3156.6968 3157.7561 3159.2660 3166.2448 3173.0382 3174.4169 3177.6250 3179.5246 3180.8160 3205.0642 3209.0781 3210.2556 3229.7236 3260.8939 3300.4335
redmass: 9.3915 1.0120 4.1019 4.2648 10.0919 4.6834 3.1957 3.5587 4.6887 8.0233 4.3441 3.5503 4.8584 10.7356 3.8562 2.1054 3.0791 1.7731 1.2563 3.2114 2.1751 1.7940 2.4476 4.2787 1.2935 4.5120 5.3942 3.2452 4.7463 2.8793 7.1804 3.2612 2.9236 2.5161 3.9906 2.4994 4.3126 2.8424 2.5454 2.5544 2.4063 3.1250 3.1280 3.3142 2.5359 1.5357 1.8278 1.4326 1.5730 1.8218 2.2090 2.4146 1.3789 3.7554 1.7851 1.4759 1.4769 1.2184 2.0494 1.3724 1.3967 1.4440 1.7324 1.2856 1.2726 1.1313 1.3968 1.5596 1.4549 1.5770 1.5825 1.4916 2.2426 1.4485 2.0113 1.4753 1.6257 1.8899 1.5954 1.7177 1.3109 1.3262 1.2300 1.5375 1.2159 1.2671 1.0362 1.0365 1.1062 1.1173 1.0882 1.0679 1.1008 1.0926 1.1272 1.0972 1.2870 1.3972 1.1776 1.1758 3.6466 4.2992 4.6425 12.6195 1.0565 1.0560 1.0433 1.0410 1.0355 1.0665 1.0679 1.0794 1.0815 1.0917 1.1026 1.1008 1.0930 1.0957 1.0890 1.1035 1.0643 1.0885 1.0990 1.1028 1.1051 1.1053 1.0993 1.0884 1.1170
irintensity: 1651.7635 0.0277 5.6688 6.5493 0.7765 1.8860 0.9193 2.4264 3.9591 8.1358 1.2286 0.8525 3.7959 5.1794 9.5381 3.1775 3.6931 1.5140 2.3911 11.4414 2.6537 2.5974 3.7120 2.7642 1.4103 4.7061 9.9343 5.2951 32.2337 13.6324 29.3788 1.3317 7.5897 0.0916 5.7418 1.6358 3.2384 12.8701 15.1561 2.9010 7.3223 19.3991 3.7069 8.8041 4.6614 22.4893 41.8823 179.5198 100.8914 5.4489 39.7217 30.3858 34.8177 0.3926 21.6910 4.8078 4.4972 28.4046 10.8448 13.6525 9.7142 54.6557 32.9253 2.1450 2.8151 33.3725 38.8295 2.5890 20.8005 37.0105 3.4117 11.2811 36.2706 6.3685 3.8327 94.8485 39.5396 39.9022 62.8690 56.1561 0.2559 8.0445 3.0668 21.4328 9.7058 32.3664 12.0907 12.8839 7.0720 15.0280 1.7487 6.4187 4.6596 0.9730 7.1650 5.8889 24.6331 25.2460 21.2599 35.3505 15.0860 899.9476 182.1292 11.5880 81.4488 147.5440 22.0124 50.5490 0.3367 8.5380 44.7660 27.8960 28.1150 6.0402 23.8246 8.8002 12.5491 3.8101 16.0013 21.4933 5.5538 7.5178 11.7503 7.9853 0.5620 0.8348 5.2796 9.8051 4.1966
temp: 298.150 k
press: 1.00000 atm
elementType: 6 6 6 6 6 6 1 1 1 1 1 1 1 1 6 1 6 1 46 17 17 6 7 7 6 1 1 1 6 1 1 1 7 6 1 1 1 6 1 1 1 6 1 1 1
symmnumber: 1
zpe: 988708.3 jmol-1
zpe.correction: 0.376579 hartree
zpe.thermalcorrener: 0.402220 hartree
zpe.thermalcorrenthalpy: 0.403164 hartree
zpe.thermalcorrgfe: 0.319108 hartree
zpe.sumelectzpe: -1758.373686 hartree
zpe.sumelectthermal: -1758.348045 hartree
zpe.sumelectthermalent: -1758.347101 hartree
zpe.sumelectthermalfe: -1758.431157 hartree
dipole: -0.8878 4.0220 -1.6154
dipole: 4.4243
quadrupole: -104.8015 -145.6436 -146.5063
quadrupole: 4.7681 -10.9714 5.3627
quadrupole: 27.5156 -13.3265 -14.1891 4.7681 -10.9714 5.3627
hfenergy: -1758.7502651 hartree
pointgroup: C01 [X(C14H25Cl2N3Pd1)]
dipole: 0.3428127 -1.5847746 -0.633097 debye
polarizability: 333.7085513|-11.5323978|299.3425028|-6.8502412|3.2774443|180.0079322 unknown
InChI: InChI=1S/C12H22N2.C2H3N.2ClH.Pd/c1-6-7-9-12(14(4)5)10-8-11-13(2)3;1-2-3;;;/h6,8,10-11H,1,7,9H2,2-5H3;1H3;2*1H;/q;;;;+2/p-2
charge 0 multiplicity 1
45 atoms
C  2.6650202 1.45607728 -0.23252482
C  0.7004153 0.83113141 -0.3756638
C  2.54709827 -1.73668466 0.22650412
C  0.29400826 0.52744776 0.97413357
C  2.29425337 -1.07435792 1.56023487
C  0.83248315 -0.6563626 1.78894052
H  2.63627557 1.38598895 0.86077275
H  0.79641514 0.00690832 -1.08408252
H  0.20313472 1.43734298 1.58177514
H  2.98848774 -0.23136227 1.66480989
H  0.35997068 1.78471209 -0.79175521
H  2.58858358 -1.77963608 2.35274862
H  0.72288793 -0.39335126 2.85193912
H  0.19271703 -1.53389588 1.62002776
C  3.10950271 0.38664369 -1.01535491
H  3.35347278 0.69221289 -2.04164049
C  3.07339694 -1.01853615 -0.85283706
H  3.31451328 -1.57116645 -1.75948736
Pd -1.60449747 0.22342228 0.22599848
Cl -2.04131706 2.40986184 0.84496898
Cl -0.99802211 -1.920277 -0.57651759
C  -4.66234968 -0.16708755 -0.78393338
N  -3.56664651 -0.0480396 -0.4439788
N  2.24261719 -3.04718024 0.10234206
C  1.48169434 -3.79814382 1.08818905
H  0.40622998 -3.75142967 0.83862538
H  1.81562031 -4.84535915 1.08267301
H  1.62169646 -3.40516748 2.0995308
C  2.25611052 -3.65802342 -1.21594735
H  3.26048218 -3.63766975 -1.6632234
H  1.94377684 -4.70493465 -1.12564679
H  1.5466562 -3.13226782 -1.8784108
N  2.74946045 2.78668675 -0.72631822
C  4.08027485 3.24138105 -1.08252078
H  4.01586564 4.220149 -1.58174101
H  4.74443983 3.3538845 -0.19849392
H  4.56121142 2.54370971 -1.78168407
C  2.06694895 3.73318575 0.13445681
H  2.56446098 3.83470597 1.12452282
H  2.05301533 4.7260545 -0.33787766
H  1.02249355 3.43310211 0.31230669
C  -6.04507413 -0.30967773 -1.21216468
H  -6.56249199 -1.03513123 -0.57053303
H  -6.55799378 0.65878279 -1.14398157
H  -6.08081493 -0.66316223 -2.25110921
