program: Gaussian 16
title: Title Card Required
version: ES64L-G16RevC.01
frameworkgroup: C1[X(C14H25Cl2N3Pd)]
method: RMN15
basis: def2QZVPP
operation: Freq
keyword: #N
keyword: Geom=AllCheck
keyword: Guess=TCheck
keyword: SCRF=Check
keyword: GenChk
keyword: RMN15/def2QZVPP
keyword: Freq
converged: YES YES NO YES
title: Mulliken charges:
elementType: C C C C C C H H H H H H H C C H Pd Cl Cl C N N C H H H C H H H H N C C H H H H H H H C H H H
charge: -0.395244 0.134632 0.206329 -0.916154 -0.598109 -0.234621 0.205268 0.226944 0.258516 0.161221 0.196406 0.233106 0.176349 -0.288195 -0.013419 0.172151 0.973129 -0.546693 -0.566986 0.193022 -0.623023 -0.213229 -0.233288 0.090250 0.119707 0.117222 -0.202186 0.119256 0.127134 0.100962 0.223242 -0.071389 -0.175647 -0.236444 0.155353 0.123365 0.116971 0.158161 0.142993 0.129155 0.220283 -0.283199 0.173550 0.169782 0.173365
chargesum: -0.00000
title: Mulliken charges with hydrogens summed into heavy atoms:
elementType: C C C C C C C C Pd Cl Cl C N N C C N C C C
charge: 0.030308 0.361576 0.206329 -0.657637 -0.240483 0.174834 -0.064954 0.158732 0.973129 -0.546693 -0.566986 0.193022 -0.623023 -0.213229 0.093891 0.145166 -0.071389 0.220042 0.193866 0.233499
1716.lowfreq: -10.4896 0.0004 0.0009 0.0016 6.8192 10.9836 22.5440 30.4283 33.8360
frequency: 22.3727 30.3819 33.2759 45.2149 49.6127 51.1109 57.1788 74.6519 88.9841 103.9257 104.3094 113.1073 122.2376 140.1110 142.7494 147.6227 161.1856 170.1631 182.8148 192.3561 198.5530 212.9652 224.4323 231.9692 258.2607 272.3021 275.4270 287.0060 290.5779 317.0583 337.7733 395.5776 404.4684 427.0928 430.4310 441.3571 451.2019 457.7270 477.4210 508.5829 522.2604 565.0557 615.6711 669.4082 704.3489 745.6682 815.4724 833.5102 852.2658 868.9283 901.3610 957.6361 962.7660 968.3383 986.9720 994.8771 1025.6344 1030.7152 1034.1804 1043.2950 1044.9889 1072.9339 1078.9151 1079.7984 1103.0914 1104.5428 1106.8898 1140.3010 1150.1619 1159.7465 1189.7701 1197.9124 1239.7243 1250.0249 1287.5854 1294.5605 1297.2115 1332.8091 1338.7250 1381.8033 1392.2709 1405.7580 1423.2223 1424.1411 1433.6771 1433.9699 1435.4187 1435.5901 1441.2445 1450.1030 1458.1086 1458.9783 1459.8391 1464.4644 1467.2160 1476.8661 1479.4078 1480.9048 1497.9484 1501.9809 1661.2554 1669.4164 1707.3120 2425.2741 2991.5588 3002.3163 3041.4667 3063.8096 3076.8199 3077.4617 3094.9447 3098.4991 3115.3498 3119.2629 3136.3696 3145.2847 3149.2121 3150.8960 3155.3350 3158.8036 3167.3168 3183.2686 3184.3846 3185.4882 3191.7703 3200.0396 3208.3359 3243.5171 3281.9618
redmass: 4.3551 3.9532 5.6186 4.4569 4.0535 1.0514 3.5445 4.0859 3.6116 6.4668 3.5014 3.5582 4.7541 4.1373 1.6796 2.1933 3.9680 3.6265 1.7131 1.6679 2.2088 3.8593 3.5806 2.3617 5.3354 2.9339 2.8362 6.9838 1.4413 2.6879 7.2856 2.4560 2.7363 4.1150 2.8891 3.8529 2.7074 2.4870 2.4064 2.4728 2.8188 3.2487 2.7798 2.1690 2.5789 1.3726 2.4464 1.4337 2.2809 2.7358 2.2178 1.5073 1.3935 4.0047 1.6168 1.5500 1.3629 1.6372 1.3012 1.4750 1.4702 1.3688 1.5486 1.6519 2.0940 1.2444 1.2706 1.5856 1.4253 1.4240 1.3690 1.3579 1.7963 1.8942 1.7790 2.5096 1.6102 1.6021 1.5700 1.6721 1.2625 2.3476 1.2349 1.2226 1.2357 1.2594 1.0363 1.0358 1.4525 1.2272 1.1126 1.0506 1.0401 1.0645 1.1374 1.0468 1.0870 1.0805 1.2036 1.1618 4.9269 4.8461 5.1601 12.6443 1.0551 1.0566 1.0808 1.0354 1.0581 1.0378 1.0340 1.0796 1.0789 1.1027 1.1043 1.0756 1.1050 1.1019 1.1016 1.0748 1.0855 1.1032 1.1033 1.1027 1.1040 1.0602 1.0901 1.1162 1.1151
irintensity: 2.9952 8.2001 3.5032 9.5170 2.4919 0.4994 12.2386 5.8369 1.0284 1.4510 0.5200 0.1127 4.6352 6.6327 0.8918 1.9148 11.2515 4.6155 1.6833 0.7295 2.0445 1.6865 6.6950 9.7615 8.0833 12.3320 1.5599 9.9033 1.0718 19.9557 62.7583 3.2369 1.0660 0.0744 1.8947 4.3638 9.8188 24.0839 6.2218 16.3921 5.2869 5.9040 47.7606 10.4318 17.3352 4.2633 5.6222 65.1943 27.3986 15.4647 3.3409 114.1484 68.2863 2.6728 4.0458 12.2688 17.0364 46.9837 12.8359 6.8000 6.9570 13.8091 24.3576 13.0955 2.5984 1.6336 11.5042 46.3569 47.9250 5.6018 9.4985 26.8752 3.6758 72.3878 40.9937 31.3446 11.8665 32.9865 8.9843 19.9260 1.0189 137.0835 6.6398 15.3900 1.9811 2.8282 17.2892 17.4485 4.3139 74.1334 17.4304 15.8576 3.5756 6.7305 4.9262 11.1738 10.1710 11.2680 26.0574 84.9929 246.0357 606.2796 27.1472 81.6118 94.5627 155.3222 23.8249 19.8990 41.5217 34.6235 0.6887 41.7802 37.6174 19.9559 5.5233 24.8931 13.9579 18.6590 39.9911 9.4190 7.8896 0.9291 1.0314 5.7670 10.9520 6.6459 2.4297 15.2421 6.4331
temp: 298.150 k
press: 1.00000 atm
elementType: 6 6 6 6 6 6 1 1 1 1 1 1 1 6 6 1 46 17 17 6 7 7 6 1 1 1 6 1 1 1 1 7 6 6 1 1 1 1 1 1 1 6 1 1 1
symmnumber: 1
zpe: 985670.6 jmol-1
zpe.correction: 0.375422 hartree
zpe.thermalcorrener: 0.402611 hartree
zpe.thermalcorrenthalpy: 0.403555 hartree
zpe.thermalcorrgfe: 0.315327 hartree
zpe.sumelectzpe: -1760.349492 hartree
zpe.sumelectthermal: -1760.322303 hartree
zpe.sumelectthermalent: -1760.321359 hartree
zpe.sumelectthermalfe: -1760.409587 hartree
dipole: -0.7611 4.8685 1.0056
dipole: 5.0292
quadrupole: -93.7707 -127.2229 -165.9310
quadrupole: 14.0313 -6.7256 13.0394
quadrupole: 35.2042 1.7519 -36.9561 14.0313 -6.7256 13.0394
hfenergy: -1760.7249136 hartree
pointgroup: C01 [X(C14H25Cl2N3Pd1)]
dipole: -0.2111504 1.735412 0.9267329 debye
polarizability: 389.3833752|29.8140134|334.2169949|20.0318292|-2.2134617|324.1506668 unknown
InChI: InChI=1S/C12H22N2.C2H3N.2ClH.Pd/c1-7-12(11(2)14(5)6)9-8-10-13(3)4;1-2-3;;;/h7-8,10,12H,1-2,9H2,3-6H3;1H3;2*1H;/q;;;;+2/p-2
charge 0 multiplicity 1
45 atoms
C  3.43659172 1.31383169 0.94675523
C  0.04711534 1.7416288 0.34958142
C  3.04222198 -1.30793709 -0.32221566
C  0.26651012 0.36027042 0.06904092
C  2.19839801 -2.24699388 0.14106408
C  1.02985238 0.03960486 -1.20418315
H  3.5545038 0.43451309 1.56971908
H  -0.06673935 2.42662232 -0.48368266
H  0.59008506 -0.21592804 0.93051864
H  1.12823951 -2.11384661 0.09753841
H  2.54777968 -3.17060836 0.57709432
H  0.68551926 -0.89939085 -1.63881763
H  0.82237021 0.81698437 -1.94169708
C  3.00939757 1.22268262 -0.30653008
C  2.55720609 -0.03808417 -0.99767955
H  2.98634239 -0.03191958 -2.00538584
Pd -1.7428649 -0.08738173 -0.17258066
Cl -1.56175001 -1.57302254 1.58604493
Cl -1.97156375 1.33596916 -1.99603698
C  -4.79715966 -1.00592931 -0.57483429
N  -3.71768276 -0.65849396 -0.42076923
N  4.42442349 -1.42221939 -0.20483689
C  4.93154655 -2.63776057 0.38510281
H  4.70430162 -3.5274508 -0.21830628
H  6.01168115 -2.55842725 0.48961686
H  4.501287 -2.78620069 1.37581018
C  5.27173367 -0.866258 -1.24224653
H  5.07282626 0.19280846 -1.39226174
H  6.30991722 -0.95951403 -0.92911684
H  5.15852086 -1.38397414 -2.20338651
H  2.90347141 2.1282752 -0.89949607
N  -0.05640898 2.27693702 1.53796826
C  0.10264931 1.47758254 2.74166611
C  -0.44127591 3.66630743 1.71491875
H  1.07925267 0.99204045 2.74136361
H  0.02436486 2.1294025 3.60653059
H  -0.66971266 0.70819213 2.78642803
H  -1.4046923 3.72040458 2.2215337
H  0.30414145 4.17897331 2.32100608
H  -0.51893438 4.14938166 0.74531742
H  3.6909698 2.27113495 1.38424932
C  -6.16210357 -1.44653736 -0.76979647
H  -6.24708701 -2.49721197 -0.5018074
H  -6.82765015 -0.85946576 -0.14084374
H  -6.44205402 -1.31455751 -1.81246847
