program: Gaussian 16
title: Title Card Required
version: ES64L-G16RevC.01
method: RMN15
basis: def2SVP
operation: Freq
keyword: #N
keyword: Geom=AllCheck
keyword: Guess=TCheck
keyword: SCRF=Check
keyword: GenChk
keyword: RMN15/def2SVP
keyword: Freq
converged: YES YES NO NO
title: Mulliken charges:
elementType: C C C C C C H H H H H H H C H C H Pd Cl Cl C N C H H H H N H H N H H
charge: 0.004379 0.183116 -0.048176 -0.112315 -0.028168 0.115679 -0.007442 -0.005118 0.071367 0.002551 -0.008489 0.065776 0.066465 -0.034725 -0.015773 -0.020764 0.006360 -0.122244 -0.278378 -0.282314 -0.248909 0.183667 0.083223 0.088847 0.090377 0.089749 0.043611 -0.117316 0.109007 0.114017 -0.177352 0.096298 0.092996
chargesum: -0.00000
title: Mulliken charges with hydrogens summed into heavy atoms:
elementType: C C C C C C C C Pd Cl Cl C N C N N
charge: -0.003064 0.221609 -0.048176 -0.040948 -0.034106 0.247919 -0.050498 -0.014404 -0.122244 -0.278378 -0.282314 -0.248909 0.183667 0.352196 0.105708 0.011942
chargesum: 0.00000
1716.lowfreq: -0.4046 -0.0014 -0.0007 0.0018 3.3856 4.0227 12.8488 15.2432 26.3006
frequency: 12.8349 15.2392 26.2953 27.1127 39.1901 63.5655 79.8589 93.2651 108.7380 113.3631 139.8350 155.0687 166.6376 170.9837 190.0429 211.2651 225.3017 272.6848 274.7386 304.8909 326.2780 333.1211 362.9225 379.6210 395.0125 408.2476 423.2128 423.7230 444.8234 448.0265 476.2592 505.2986 536.6994 609.9410 705.3687 731.2678 760.3536 780.3554 813.2658 832.4845 860.6573 897.3504 929.6788 969.1959 971.1500 982.0265 990.9173 998.5289 1022.4748 1023.4122 1024.2642 1045.7120 1089.9091 1107.1257 1154.1502 1172.7650 1209.9556 1236.8477 1264.6020 1284.1806 1304.5701 1330.1258 1369.2495 1371.4452 1390.2928 1395.3287 1415.6239 1416.6733 1434.6245 1443.0951 1581.0804 1594.1121 1597.0542 1723.3095 1751.0711 2475.4230 3093.3308 3101.1219 3142.8218 3158.8069 3162.3891 3169.7994 3185.5085 3189.2349 3202.5430 3212.1797 3213.8198 3290.0095 3301.9464 3524.7725 3599.7945 3618.3012 3718.9440
redmass: 1.0170 6.1787 4.1262 4.8443 5.1384 5.6999 5.0896 4.7445 4.4286 8.2000 3.8338 7.6424 6.0438 5.0125 5.5934 3.9090 5.1100 1.2545 8.8463 2.9048 27.8494 2.3792 1.3285 8.9938 2.0178 3.4506 3.1890 2.4650 2.1880 4.0734 2.5503 1.4736 2.5051 2.6219 2.8439 1.2562 1.2394 1.4244 1.6803 1.5071 2.0426 1.5836 1.7878 1.5005 1.4179 2.3630 2.1346 1.2968 1.3198 1.4885 1.4805 1.3347 1.4547 1.6518 2.9571 1.3691 1.4506 1.2504 1.3351 1.4435 1.3265 2.0320 1.3110 1.4002 1.2122 1.1754 1.0359 1.0364 1.8974 1.2797 1.2138 2.3573 1.3618 6.2281 8.5000 12.6426 1.0607 1.0353 1.0879 1.0906 1.0988 1.0570 1.0927 1.0639 1.0909 1.1051 1.1056 1.1200 1.1168 1.0518 1.0479 1.0921 1.1007
irintensity: 0.0254 1.2523 0.5293 5.5804 5.6800 1.6663 1.3396 1.1705 1.1674 2.2212 0.4203 6.2906 0.8482 1.1669 1.9099 4.0139 2.6345 36.2521 3.7556 1.5875 1.1932 25.5856 36.4887 46.4686 15.6549 9.0586 14.0147 37.4153 9.6239 2.2432 48.4798 183.4077 26.5540 7.2116 8.9858 2.9263 3.0933 31.2446 135.9515 48.3464 53.5024 6.5404 2.4261 2.0449 38.5579 0.6640 3.7859 8.5054 0.2808 7.2415 5.7814 0.0896 5.4552 11.0260 11.6976 11.4086 0.0139 9.1186 5.2701 17.4801 5.0708 20.0436 0.2598 9.8249 14.0767 1.3568 13.7958 13.9541 27.7654 19.7264 53.8614 38.0596 12.7456 111.1312 2.1981 41.5560 3.5205 0.6867 2.3124 4.9606 10.9395 0.9092 19.1401 2.5518 0.0967 2.3206 2.4136 0.1449 6.9268 0.4865 19.7367 2.6561 20.9729
temp: 298.150 k
press: 1.00000 atm
elementType: 6 6 6 6 6 6 1 1 1 1 1 1 1 6 1 6 1 46 17 17 6 7 6 1 1 1 1 7 1 1 7 1 1
symmnumber: 1
zpe: 688453.9 jmol-1
zpe.correction: 0.262218 hartree
zpe.thermalcorrener: 0.283989 hartree
zpe.thermalcorrenthalpy: 0.284933 hartree
zpe.thermalcorrgfe: 0.206631 hartree
zpe.sumelectzpe: -1601.639706 hartree
zpe.sumelectthermal: -1601.617935 hartree
zpe.sumelectthermalent: -1601.616991 hartree
zpe.sumelectthermalfe: -1601.695293 hartree
dipole: -4.4625 0.4055 -0.2137
dipole: 4.4860
quadrupole: -77.5032 -129.0872 -127.3586
quadrupole: 3.5923 -8.2733 5.3519
quadrupole: 33.8132 -17.7709 -16.0423 3.5923 -8.2733 5.3519
hfenergy: -1601.9019239 hartree
pointgroup: C01 [X(C10H17Cl2N3Pd1)]
dipole: -1.7556796 0.1595475 -0.0840677 debye
polarizability: 224.7650263|-4.6809515|186.9320681|1.8414083|-9.6713692|148.0751404 unknown
InChI: InChI=1S/C8H14N2.C2H3N.2ClH.Pd/c1-3-4-8(10)6-5-7(2)9;1-2-3;;;/h3,5-6,8H,1-2,4,9-10H2;1H3;2*1H;/q;;;;+2/p-2
charge 0 multiplicity 1
33 atoms
C  2.76809226 1.41313647 0.94886521
C  1.25317132 1.37288741 0.65956848
C  4.00350143 -1.25124405 -0.29018823
C  0.8246182 -0.00739842 0.26950161
C  4.40309647 -1.53927228 0.96615424
C  0.60129181 -0.42835365 -1.03063145
H  2.99749092 0.58335371 1.63161175
H  0.98849394 2.09239009 -0.13101732
H  0.92425615 -0.78475555 1.03647917
H  4.83117371 -0.7634854 1.60071358
H  4.3585167 -2.55958606 1.35568145
H  0.56653453 -1.49835506 -1.25332197
H  0.67290744 0.28386032 -1.85810828
C  3.53801058 1.2388018 -0.33936023
H  3.62564502 2.16287123 -0.92734803
C  4.05149702 0.11638926 -0.86691455
H  4.51478688 0.17480134 -1.85954214
Pd -1.34001001 -0.1340757 -0.16094136
Cl -1.26713293 -2.23562348 0.77410598
Cl -1.46053622 1.91888692 -1.19939663
C  -4.48908341 0.00241297 0.3475157
N  -3.35122943 -0.04945555 0.17366043
C  -5.92374211 0.06846411 0.56723526
H  -6.12523539 0.447584 1.57791364
H  -6.38156553 0.7429726 -0.16824886
H  -6.36193479 -0.93307596 0.4651709
H  0.74442536 1.68495466 1.58507226
N  3.59712412 -2.20988497 -1.21171385
H  2.94323006 -1.90384477 -1.92573034
H  3.40663524 -3.14014918 -0.85159732
N  3.07135669 2.66081296 1.63527267
H  4.06800567 2.72341143 1.84623563
H  2.84586029 3.45767477 1.0348526
