program: Gaussian 16
title: Title Card Required
version: ES64L-G16RevC.01
frameworkgroup: C1[X(C12H20Cl2N2Pd)]
method: RMN15
basis: def2SVP
operation: Freq
keyword: #N
keyword: Geom=AllCheck
keyword: Guess=TCheck
keyword: SCRF=Check
keyword: GenChk
keyword: RMN15/def2SVP
keyword: Freq
converged: YES YES NO YES
title: Mulliken charges:
elementType: C C C C C C H H H H H H H C H C Pd Cl Cl C N H H C H H H N C H H H C H H H H
charge: 0.111176 0.058961 -0.065738 -0.079819 0.023146 0.057597 -0.002267 0.035357 0.086361 0.028230 0.023036 0.047475 0.042177 -0.157209 0.009820 0.132603 -0.184860 -0.299609 -0.300169 -0.280067 0.201572 -0.016702 0.005708 0.086683 0.083026 0.081107 0.078410 -0.282403 0.118768 0.066075 0.043375 0.017792 0.124691 0.020113 0.026771 0.038533 0.020277
chargesum: -0.00000
title: Mulliken charges with hydrogens summed into heavy atoms:
elementType: C C C C C C C C Pd Cl Cl C N C N C C
charge: 0.129187 0.100026 -0.082440 0.006542 0.074413 0.147250 -0.147388 0.132603 -0.184860 -0.299609 -0.300169 -0.280067 0.201572 0.329226 -0.282403 0.246009 0.210108
1716.lowfreq: -586.3756 -6.7728 -1.0774 0.0019 0.0022 0.0030 10.4501 17.0203 30.8491
frequency: -586.3756 16.9837 30.7966 32.3961 51.7556 78.1687 92.5633 108.6636 115.8413 131.2949 154.1451 158.7030 167.9926 180.1189 199.8030 210.3296 223.1464 236.0677 253.5443 270.9764 288.4370 300.1559 316.4197 328.9714 361.8372 380.1900 402.2266 421.0609 428.4552 440.0430 458.0877 474.3682 531.7635 558.4519 640.3498 672.2050 735.5984 781.0505 794.7998 819.1555 862.9581 876.0635 901.2758 943.1108 959.6667 977.6121 986.9448 1012.8740 1024.8331 1025.6038 1032.6259 1075.5800 1087.7836 1092.5253 1110.0508 1120.1607 1138.8973 1155.2047 1175.5509 1196.7402 1226.2672 1228.9581 1270.1709 1297.1540 1307.6305 1333.6013 1349.2554 1370.4314 1380.5051 1387.6139 1401.2498 1419.3780 1420.0674 1421.2125 1428.1627 1432.8476 1440.3207 1445.2679 1456.2714 1469.1280 1486.4138 1516.2961 1529.6681 1596.0678 2462.5920 2999.2624 3059.4758 3063.3467 3087.4699 3100.2217 3125.5343 3137.7990 3148.8317 3155.5156 3163.9858 3172.2830 3177.9367 3194.9216 3198.0429 3204.4634 3209.3651 3210.7306 3255.1615 3260.0387 3278.3474
redmass: 5.2957 1.0201 4.2420 4.0362 6.7468 5.3217 4.1915 4.9436 3.6194 8.0189 4.8911 4.0667 7.6064 5.4215 1.3304 5.1280 4.0247 4.8679 1.4996 1.9431 3.4662 16.4590 2.9485 3.1266 17.3715 2.3705 2.1428 3.8718 3.9724 4.6572 2.8437 2.7905 2.9539 2.2979 2.7591 2.0997 1.6979 2.1579 1.6559 1.8077 1.4164 2.5638 1.5789 1.6083 1.6361 3.7635 1.5891 1.7121 1.4785 1.4786 1.6280 1.3723 1.3628 1.3665 1.4533 1.3929 1.2399 1.2811 1.5575 1.2803 1.2497 1.2382 1.5730 1.4982 1.7761 1.3521 1.6283 1.3099 1.2774 1.5175 1.2190 1.0362 1.0366 1.2069 1.1704 1.0590 1.1272 1.1885 1.1211 1.1019 2.5453 2.2295 3.0028 4.3917 12.6198 1.0542 1.0388 1.0657 1.0692 1.0355 1.0870 1.0594 1.1041 1.0980 1.0964 1.0875 1.0638 1.1030 1.0913 1.1004 1.1050 1.1054 1.1123 1.0924 1.1067
irintensity: 408.8589 0.0838 5.5088 6.1846 0.8928 6.1803 0.8181 2.8155 2.0119 6.9898 3.8481 1.7138 2.6499 2.6234 0.5145 0.6962 2.0318 2.9120 0.9433 3.7999 5.0765 2.7706 4.8494 3.0593 34.4716 2.4943 2.7429 0.7528 0.4661 0.5804 8.0420 1.5079 1.6981 0.7709 5.4250 4.0831 2.8169 4.1298 28.9230 16.1281 89.1457 34.9499 16.1054 8.2166 9.2617 2.6830 8.4729 2.1698 4.9659 4.9581 12.0708 9.3664 0.5087 1.3819 9.1853 28.6274 22.6220 6.0007 4.2906 6.4557 13.0367 1.1654 23.0176 18.4251 9.5058 3.4940 30.4019 0.0477 1.9556 8.8980 0.3221 12.5600 13.9772 54.2727 3.4456 5.5194 2.6405 12.9843 2.2989 0.9621 34.9516 10.0332 223.9257 388.7321 16.4281 11.5714 51.8611 30.8219 42.1881 0.1632 22.1968 1.0056 18.3846 1.4366 3.2082 2.1255 24.4357 1.5521 10.0516 27.4196 0.6602 0.9102 2.5954 2.1180 3.0470
temp: 298.150 k
press: 1.00000 atm
elementType: 6 6 6 6 6 6 1 1 1 1 1 1 1 6 1 6 46 17 17 6 7 1 1 6 1 1 1 7 6 1 1 1 6 1 1 1 1
symmnumber: 1
zpe: 794812.3 jmol-1
zpe.correction: 0.302728 hartree
zpe.thermalcorrener: 0.324044 hartree
zpe.thermalcorrenthalpy: 0.324988 hartree
zpe.thermalcorrgfe: 0.250772 hartree
zpe.sumelectzpe: -1624.753496 hartree
zpe.sumelectthermal: -1624.732180 hartree
zpe.sumelectthermalent: -1624.731236 hartree
zpe.sumelectthermalfe: -1624.805452 hartree
dipole: 1.0331 -1.0462 -2.8251
dipole: 3.1848
quadrupole: -94.2549 -123.2029 -135.4243
quadrupole: -9.0626 -10.8142 -10.8550
quadrupole: 23.3725 -5.5756 -17.7969 -9.0626 -10.8142 -10.8550
hfenergy: -1625.0562243 hartree
pointgroup: C01 [X(C12H20Cl2N2Pd1)]
dipole: 0.4056701 0.414625 1.1106283 debye
polarizability: 248.2833026|-6.3528293|218.9344755|-6.6741474|-13.1003224|183.6419524 unknown
InChI: InChI=1S/C10H17N.C2H3N.2ClH.Pd/c1-5-7-8-9-10(6-2)11(3)4;1-2-3;;;/h5-6,9H,1-2,7-8H2,3-4H3;1H3;2*1H;/q;;;;+2/p-2
charge 0 multiplicity 1
37 atoms
C  -1.3770763 -1.98362784 -1.07536988
C  -0.65400402 -2.81415076 0.02279605
C  -2.86413527 0.15009621 0.73330266
C  -0.39580279 -2.00225494 1.25426335
C  -2.96550407 -1.13084289 1.31455778
C  -1.40248893 -1.75511509 2.18902007
H  -2.45520653 -2.20724274 -1.12104386
H  0.30968902 -3.13871178 -0.39491308
H  0.61517102 -1.62318162 1.43956112
H  -3.05970926 -1.99967334 0.66364121
H  -3.65449741 -1.18218106 2.16318622
H  -1.99032155 -2.64074342 2.45717629
H  -1.16246358 -1.08720051 3.0213439
C  -1.14898995 -0.45743948 -1.03717172
H  -0.92836388 -0.13093695 -2.0596284
C  -2.09915883 0.4703473 -0.40667996
Pd 0.70554922 -0.00623515 -0.21255499
Cl 1.58638427 -1.24445388 -1.96895992
Cl -0.06782383 1.33300785 1.54756676
C  3.74751529 0.69375017 0.73727458
N  2.66498886 0.44148721 0.42915329
H  -3.26634865 0.97633719 1.31795032
H  -1.25287782 -3.70818822 0.27111092
C  5.11394421 1.0139553 1.11966399
H  5.75239056 1.04612619 0.22690584
H  5.14361974 1.99107015 1.61956412
H  5.49964125 0.24899209 1.80647816
N  -2.138362 1.74638569 -0.88801704
C  -1.15392156 2.20847731 -1.84400975
H  -0.12532784 2.05450761 -1.45671162
H  -1.22847614 1.68547813 -2.80920522
H  -1.3070096 3.27858739 -2.02510836
C  -2.89194241 2.75875353 -0.1728114
H  -2.87665309 3.69168021 -0.74835214
H  -3.94178266 2.45318142 -0.0493516
H  -2.45407471 2.9458656 0.82271296
H  -0.95809677 -2.32035187 -2.03249765
