program: Gaussian 16
title: Title Card Required
version: ES64L-G16RevC.01
frameworkgroup: C1[X(C16H19Cl2NPd)]
method: RMN15
basis: def2SVP
operation: Freq
keyword: #N
keyword: Geom=AllCheck
keyword: Guess=TCheck
keyword: SCRF=Check
keyword: GenChk
keyword: RMN15/def2SVP
keyword: Freq
converged: YES YES NO YES
title: Mulliken charges:
elementType: C C C C C C H H H H H H H C C H Pd Cl Cl C N C H H H H H H C C C C H C H C H H H
charge: 0.181412 0.064619 -0.054232 -0.123103 0.086131 0.095979 0.002846 0.022197 0.031179 -0.003145 -0.002168 -0.010015 0.029883 -0.309555 0.079194 0.016777 -0.112318 -0.301514 -0.014838 -0.266939 0.155309 0.084657 0.076452 0.075448 0.089275 -0.000051 0.016106 -0.001227 0.078931 0.015195 0.001480 0.017869 -0.018705 0.017674 -0.016065 0.030614 -0.012331 -0.012138 -0.010883
chargesum: -0.00000
title: Mulliken charges with hydrogens summed into heavy atoms:
elementType: C C C C C C C C Pd Cl Cl C N C C C C C C C
charge: 0.183031 0.086766 -0.038126 -0.091925 0.080818 0.115848 -0.309555 0.095970 -0.112318 -0.301514 -0.014838 -0.266939 0.155309 0.325831 0.078931 -0.003510 -0.014585 0.005538 0.005537 0.019730
chargesum: 0.00000
1716.lowfreq: -3.5696 -0.0014 0.0017 0.0019 3.3375 5.5021 22.7598 25.1171 28.2151
frequency: 22.7542 25.1156 28.2069 38.8982 45.1989 64.5739 75.4931 110.2937 130.2180 143.9191 149.1257 171.6734 186.5768 197.8899 212.7514 230.0909 250.8636 271.7471 275.3137 301.2338 328.3687 339.7232 360.8416 376.5086 405.5288 417.4963 420.4775 424.9430 462.3158 504.5297 534.5355 544.8528 613.0231 628.1213 670.3594 691.7696 723.2626 751.0557 779.5490 797.5866 820.7564 839.5728 867.3355 873.2450 919.7687 930.3483 956.5170 973.1859 975.7584 997.2309 1013.2735 1019.3961 1022.2591 1022.7725 1027.4046 1046.9809 1047.7529 1060.1189 1078.1648 1091.3310 1102.0842 1118.8289 1134.8866 1153.2330 1178.2560 1208.2003 1225.6846 1233.4428 1249.8750 1269.8318 1283.0906 1305.4651 1317.8614 1340.3746 1345.4787 1366.8417 1369.1497 1370.4496 1374.4404 1405.1160 1410.6299 1418.8486 1420.8410 1424.9694 1432.3804 1473.8456 1478.0811 1525.9839 1667.1960 1688.7488 1753.7375 2449.7284 3033.3055 3035.1875 3094.9563 3099.5024 3106.0044 3110.9425 3116.7207 3140.2599 3147.8337 3160.4574 3185.0039 3204.0595 3209.1155 3209.2203 3222.7699 3228.3526 3235.9929 3242.5660 3250.8207
redmass: 3.2204 1.0870 4.0754 4.2759 9.5127 5.5767 9.7988 3.9000 7.3329 6.7194 6.0378 6.9498 6.4704 4.6720 7.7542 5.8766 2.6429 3.6095 4.1152 6.3168 4.9459 2.2264 9.8905 3.1915 4.2745 2.9085 4.1968 4.2555 4.0939 3.3352 2.4029 3.0621 5.8803 4.3809 2.1214 4.0423 1.6445 1.6686 1.9824 1.7545 3.1623 2.2256 2.0360 1.2493 2.6268 2.3513 1.5075 3.8261 1.8185 3.8739 2.2882 1.3377 1.4765 1.3353 1.4797 1.8322 1.5340 1.8832 1.2053 2.3511 1.4008 1.2876 1.2251 1.0711 1.0929 1.4468 1.4257 1.8350 1.6375 1.2998 1.4515 1.6542 1.4597 1.5629 1.5168 1.7563 1.4925 1.3980 5.4768 1.4376 1.0919 1.0366 1.0364 1.0871 1.1901 1.1253 2.6106 2.6632 6.8227 6.7814 8.1006 12.6101 1.0704 1.0718 1.0644 1.0355 1.0649 1.0911 1.0886 1.1021 1.0965 1.0971 1.0855 1.0955 1.1051 1.1052 1.0862 1.0887 1.0926 1.0965 1.1008
irintensity: 4.4939 0.4995 4.8893 0.3379 2.3181 0.4691 0.0822 0.4014 2.0058 0.4540 2.4652 1.1195 1.2045 1.4695 4.1789 1.2871 2.9576 2.3600 2.4282 1.9136 7.3024 2.0401 18.3576 0.4351 5.9312 0.1590 0.1556 1.4108 11.5916 0.5851 1.8283 8.8795 0.5902 10.0466 4.4236 0.5116 27.7489 9.2614 25.7152 23.6455 31.4787 9.4238 6.1774 0.3936 8.8337 9.7444 3.7047 1.4366 10.5230 1.6121 0.7222 1.4129 5.4665 0.5140 4.9196 3.0163 1.0669 3.2045 6.4244 7.8204 3.6377 6.1557 2.3647 0.0084 7.4052 24.8253 2.8377 8.4425 20.7811 15.4557 26.6605 4.2009 6.0671 1.7277 0.7419 3.6364 5.0408 4.3409 0.8642 4.1922 5.3044 12.2515 13.0539 6.5697 6.6893 11.1631 11.4129 13.7336 0.4097 3.2624 12.6460 17.0958 35.1122 58.5928 15.2667 0.4196 37.8155 11.7565 10.7085 17.5246 8.4198 8.8515 3.5968 9.1609 1.2898 0.3842 2.2430 0.6434 5.3659 12.1103 14.6386
temp: 298.150 k
press: 1.00000 atm
elementType: 6 6 6 6 6 6 1 1 1 1 1 1 1 6 6 1 46 17 17 6 7 6 1 1 1 1 1 1 6 6 6 6 1 6 1 6 1 1 1
symmnumber: 1
zpe: 824350.3 jmol-1
zpe.correction: 0.313978 hartree
zpe.thermalcorrener: 0.335623 hartree
zpe.thermalcorrenthalpy: 0.336567 hartree
zpe.thermalcorrgfe: 0.260194 hartree
zpe.sumelectzpe: -1721.669066 hartree
zpe.sumelectthermal: -1721.647421 hartree
zpe.sumelectthermalent: -1721.646477 hartree
zpe.sumelectthermalfe: -1721.722850 hartree
dipole: -3.4025 5.0195 1.3688
dipole: 6.2166
quadrupole: -141.2570 -124.6300 -140.8623
quadrupole: 24.3194 4.3041 2.7392
quadrupole: -5.6739 10.9531 -5.2792 24.3194 4.3041 2.7392
hfenergy: -1721.983044 hartree
pointgroup: C01 [X(C16H19Cl2N1Pd1)]
dipole: -1.0228417 2.0958972 0.7368779 debye
polarizability: 277.2022908|-13.1349434|230.2782057|12.3427452|-3.4112975|183.474899 unknown
InChI: InChI=1S/C14H16Cl.C2H3N.ClH.Pd/c15-14(13-9-5-4-6-10-13)11-7-2-1-3-8-12-14;1-2-3;;/h2,4-6,8-10,12H,1,3,7,11H2;1H3;1H;/q;;;+1/p-1
charge 0 multiplicity 1
39 atoms
C  -1.94168266 -0.94360336 -1.33790751
C  -0.63860281 -1.51094689 -1.9241136
C  -1.06205844 -1.61389334 1.58845817
C  0.5227929 -1.90301541 -1.01329529
C  -1.01614627 -2.90962514 0.83299717
C  0.23239053 -3.05163921 -0.05394988
H  -2.62753622 -1.72660289 -0.98064032
H  -0.25982194 -0.78159016 -2.65790865
H  1.35101572 -2.22867576 -1.66207901
H  -1.92253578 -3.04196527 0.22539954
H  -1.02272724 -3.73809196 1.5567182
H  0.10530749 -3.97537615 -0.65096109
H  1.12492013 -3.20621993 0.56907043
C  -1.84286828 0.07614086 -0.2038182
C  -1.39055644 -0.38697802 1.15343127
H  -1.3185003 0.44155943 1.86710358
Pd 1.38810888 -0.27855927 -0.16077484
Cl 3.18850906 -1.63219309 0.30329277
Cl -0.4744434 1.24580443 -0.72506698
C  3.25608765 2.0770645 1.1982615
N  2.4731345 1.38471278 0.70704218
C  4.26593475 2.92098527 1.81812911
H  4.56117348 3.72466725 1.13075951
H  3.87390495 3.36571855 2.7422625
H  5.14913085 2.31424348 2.05909903
H  -0.92257183 -2.40317244 -2.51590778
H  -0.72668855 -1.65959675 2.63072108
H  -2.48401936 -0.44491706 -2.15707253
C  -3.12614929 0.89020417 -0.11876014
C  -4.04888798 0.63337493 0.90133299
C  -3.45098676 1.8362368 -1.10212889
C  -5.26957518 1.31283056 0.9424097
H  -3.81234735 -0.11115071 1.66469451
C  -4.664592 2.51817986 -1.05761978
H  -2.73729805 2.04453244 -1.90351755
C  -5.57969975 2.258674 -0.0331418
H  -5.97880605 1.09906462 1.74500943
H  -4.89760604 3.25776329 -1.82673381
H  -6.53114493 2.7936626 0.00192098
