program: Gaussian 16
title: took dream537_nr2_combo3nr2 and moved dma from alkene to atom 5
version: EM64M-G16RevA.03
frameworkgroup: C1[X(C14H25Cl2N3Pd)]
method: RMN15
basis: def2SVP
operation: Freq
keyword: #N
keyword: Geom=AllCheck
keyword: Guess=TCheck
keyword: SCRF=Check
keyword: GenChk
keyword: RMN15/def2SVP
keyword: Freq
converged: YES YES NO NO
title: Mulliken charges:
elementType: C C C C C C H H H H H H H H C H C H Pd Cl Cl C N N C H H H C H H H N C H H H C H H H C H H H
charge: 0.152404 0.002141 -0.043446 0.006259 0.078614 -0.010285 -0.002516 -0.020766 -0.004747 0.042566 0.005904 0.031441 0.013622 0.015903 -0.049288 0.005444 0.002386 0.036112 -0.118177 -0.348162 -0.306126 -0.273950 0.201972 -0.205225 0.106675 0.046131 0.029874 0.073820 0.102212 0.053467 0.029823 0.052527 -0.327652 0.120495 0.017528 -0.012452 0.018242 0.116135 -0.003095 0.021151 0.014601 0.085251 0.081973 0.080553 0.080663
chargesum: -0.00000
title: Mulliken charges with hydrogens summed into heavy atoms:
elementType: C C C C C C C C Pd Cl Cl C N N C C N C C C
charge: 0.155792 -0.018625 -0.043446 0.001512 0.152620 0.019240 -0.043845 0.038498 -0.118177 -0.348162 -0.306126 -0.273950 0.201972 -0.205225 0.256500 0.238029 -0.327652 0.143812 0.148792 0.328440
1716.lowfreq: -0.2753 0.0012 0.0021 0.0023 3.3166 6.7514 11.6090 17.6043 20.0222
frequency: 11.5800 17.5489 20.0036 27.8970 34.2558 41.4025 43.7673 62.3716 74.7065 85.6227 102.0226 116.1560 127.1264 133.2141 150.3597 158.8077 167.8719 178.8421 180.3227 195.0525 218.2100 221.5886 240.8733 246.6036 262.5648 267.8610 285.7547 304.2370 321.3449 342.6973 368.7466 371.5465 388.4376 403.0154 431.4961 434.4998 443.2019 448.0138 454.6671 471.3261 542.0581 560.0276 589.7445 682.7207 688.9153 763.3505 790.8401 812.4601 866.3527 891.2993 918.3633 953.5265 955.2228 969.2588 984.0103 1006.9813 1021.4317 1024.2899 1025.4376 1027.8010 1050.2215 1057.8030 1066.6735 1069.0294 1075.7330 1082.8427 1098.2257 1127.9361 1134.8573 1159.4805 1183.6507 1205.7005 1233.5304 1237.0298 1262.0239 1269.6770 1290.2951 1317.8728 1321.1394 1349.4060 1370.6912 1376.9232 1390.6483 1392.7110 1408.6864 1411.2254 1419.3585 1419.6811 1421.4654 1428.4608 1430.7148 1434.9237 1436.5176 1442.1114 1451.8389 1453.6267 1454.4305 1460.3941 1475.7427 1481.1960 1644.0036 1743.7769 1753.3185 2469.0501 2964.0661 2985.5813 3054.4878 3074.0917 3077.1810 3084.3182 3099.8128 3108.5643 3115.2099 3142.6727 3152.1919 3163.8665 3164.4172 3164.9029 3170.0680 3180.9327 3183.1559 3189.1707 3209.0129 3210.3458 3213.6603 3214.9321 3224.3891 3248.5927 3271.7589
redmass: 1.0163 4.2016 4.4933 4.7567 4.5054 4.2811 4.0686 2.5908 4.5005 2.9780 7.9663 5.1403 4.5195 4.1185 1.5204 2.5668 4.1855 1.4613 3.0002 4.4210 2.0003 3.4751 1.4607 1.9765 1.3265 5.8747 2.2948 23.1614 2.6429 2.8958 25.6998 2.6091 2.4700 2.3338 3.3251 3.0107 2.7601 4.1727 3.0023 3.3060 3.4383 3.3288 2.9915 1.9093 1.8544 1.4324 2.0110 2.9382 1.9785 2.5229 1.4285 1.5186 1.3607 1.5966 3.7352 1.4955 1.1875 1.4761 1.4750 1.5269 1.5358 1.6142 1.9132 1.2799 1.7268 1.3055 1.3186 1.4467 1.4440 1.5015 1.5888 1.8528 1.4012 1.4099 1.5474 2.2872 1.5146 1.4384 2.8329 1.7654 1.3127 1.5621 1.3557 1.2028 1.2166 1.1883 1.0362 1.0363 1.2648 1.1502 1.1189 1.0885 1.0706 1.0728 1.1055 1.1253 1.1027 1.0909 1.0970 2.6613 6.0644 5.6579 8.0032 12.6244 1.0576 1.0562 1.0424 1.0682 1.0805 1.0365 1.0355 1.0768 1.0810 1.1004 1.0588 1.0726 1.0972 1.0997 1.0957 1.0935 1.1059 1.0871 1.1051 1.1054 1.1004 1.1007 1.1031 1.1128 1.1169
irintensity: 0.0162 0.0473 2.2828 1.9526 3.3987 2.1149 5.2396 1.2269 2.9643 0.3755 0.6831 2.8156 1.0235 5.7865 0.9453 1.3127 4.8872 0.3260 7.2449 1.0846 2.7128 2.4721 1.3795 1.0515 1.9825 5.1245 0.3549 4.4123 1.3983 12.0991 41.6703 3.7239 3.3083 6.6026 0.7954 0.3158 7.9505 2.9976 3.8400 12.2280 22.3032 1.9616 3.0317 3.1746 1.5703 19.3473 23.8932 21.9370 0.5747 27.6578 109.3127 121.3407 12.8670 7.7363 0.2562 39.8780 6.2180 5.7368 4.9975 3.5597 9.6662 16.8619 2.8892 5.0961 44.5757 4.1945 10.8552 17.4887 1.9806 15.9723 8.5241 6.1615 15.0421 5.4351 10.7964 19.6575 0.9829 3.5048 40.3650 56.3697 0.0609 32.8301 5.0956 5.0368 0.9826 9.6034 12.3457 12.5364 12.6481 13.7552 3.8620 8.6795 3.4133 7.1290 4.4173 14.0544 7.9443 7.7251 17.7309 102.2057 328.6143 1.7140 45.9257 10.1662 70.4255 68.4748 14.0239 9.8555 19.0376 25.6008 0.2521 53.2633 28.5459 7.2894 4.6402 4.4424 3.6637 32.9261 16.8909 8.6292 6.2983 12.3040 0.7775 0.7822 4.9299 4.0608 4.2670 0.4019 8.4389
temp: 298.150 k
press: 1.00000 atm
elementType: 6 6 6 6 6 6 1 1 1 1 1 1 1 1 6 1 6 1 46 17 17 6 7 7 6 1 1 1 6 1 1 1 7 6 1 1 1 6 1 1 1 6 1 1 1
symmnumber: 1
zpe: 983101.4 jmol-1
zpe.correction: 0.374444 hartree
zpe.thermalcorrener: 0.401802 hartree
zpe.thermalcorrenthalpy: 0.402746 hartree
zpe.thermalcorrgfe: 0.311440 hartree
zpe.sumelectzpe: -1758.413503 hartree
zpe.sumelectthermal: -1758.386145 hartree
zpe.sumelectthermalent: -1758.385201 hartree
zpe.sumelectthermalfe: -1758.476506 hartree
dipole: 0.2583 3.0752 -0.9199
dipole: 3.2202
quadrupole: -104.8428 -154.1535 -145.3789
quadrupole: -0.5846 5.9779 10.5903
quadrupole: 29.9490 -19.3618 -10.5872 -0.5846 5.9779 10.5903
hfenergy: -1758.7879467 hartree
pointgroup: C01 [X(C14H25Cl2N3Pd1)]
dipole: 0.0841143 1.2203856 -0.3296808 debye
polarizability: 296.5959247|9.4935987|239.1267749|5.4070703|-0.5049009|182.2054661 unknown
InChI: InChI=1S/C12H22N2.C2H3N.2ClH.Pd/c1-7-12(14(5)6)10-8-9-11(2)13(3)4;1-2-3;;;/h7-9,12H,1-2,10H2,3-6H3;1H3;2*1H;/q;;;;+2/p-2
charge 0 multiplicity 1
45 atoms
C  2.73716237 -0.79430752 -0.79216703
C  4.0921345 -0.1318825 -0.42606271
C  0.22990458 0.73354053 0.14392089
C  3.88273022 0.9667584 0.58353739
C  -0.37386179 -0.48462452 0.59544878
C  4.04461171 2.26757678 0.33260378
H  2.22197416 -1.08122549 0.13790258
H  4.50291178 0.3335962 -1.33921571
H  3.55898383 0.64808695 1.58291072
H  -0.026497 -1.37417177 0.06072298
H  2.94985401 -1.72443833 -1.34717491
H  -0.45931649 -0.63874554 1.67669895
H  3.87587257 3.02707521 1.10059574
H  4.36041348 2.61895442 -0.65556319
C  1.87389395 0.09536562 -1.6289002
H  2.18984601 0.22755784 -2.67046688
C  0.80292576 0.79294433 -1.22376336
H  0.26278801 1.45583873 -1.9079917
Pd -2.36895424 -0.40981638 -0.01905421
Cl -2.3326776 1.77376323 -0.88138909
Cl -2.47334941 -2.54077714 0.84549321
C  -5.44332745 -0.63479123 -0.87616715
N  -4.33751553 -0.53489276 -0.56581092
N  0.21549872 1.84346302 0.87029277
C  -0.56968754 1.88049703 2.09274401
H  -0.21222628 1.1378645 2.81878944
H  -0.49607147 2.87938035 2.5375849
H  -1.62345716 1.66084298 1.84139358
C  0.61723374 3.12936132 0.31923022
H  -0.25936487 3.62071389 -0.13105945
H  1.02714849 3.75626781 1.12283981
H  1.39341439 2.98814762 -0.44093595
N  5.09598632 -1.08494947 0.03764707
C  5.76365374 -1.79018562 -1.03008913
H  6.59962319 -2.37883108 -0.62196395
H  5.10330774 -2.49934742 -1.57876868
H  6.17836072 -1.07905767 -1.76043093
C  4.6623838 -1.98034007 1.08677133
H  3.96647574 -2.77226764 0.73399347
H  5.53536036 -2.48454403 1.52922005
H  4.15963198 -1.42757697 1.89377274
C  -6.83775878 -0.76679936 -1.26729808
H  -6.96973048 -1.67231404 -1.87425582
H  -7.47051948 -0.84229677 -0.3730511
H  -7.14731228 0.10811189 -1.85400976
