program: Gaussian 16
title: ts bonod 6 17 at 2.2 angstroms from scan DREAM624_imbeggingyou_combo1 (scan bond 6 17 to get back to octatriene in this stepwise 3,3 rearran gewment, last file DREAM622_imbeggingyou_combo1 (min of DREAM619_imbeg gingyou_combo1 irc (forward irc of DREAM616_imbeggingyou_combo1 ts, se ems to correspond to the bond formation and breakinng of atoms 1 and 2 (took DREAM600_imbe ggingyou_combo1 and made atoms 1 2 and 617 and m ade them both 2.1 and guessed a ts))))
version: ES64L-G16RevC.01
frameworkgroup: C1[X(C10H15Cl2NOPd)]
method: RMN15
basis: def2SVP
operation: Freq
keyword: #N
keyword: Geom=AllCheck
keyword: Guess=TCheck
keyword: SCRF=Check
keyword: GenChk
keyword: RMN15/def2SVPFreq
keyword: RMN15/def2SVP
keyword: Freq
title: ts bonod 6 17 at 2.2 angstroms from scan DREAM624_imbeggingyou_combo1
converged: YES YES NO YES
title: Mulliken charges:
elementType: C C C C C C H H H H H H H H H C C H Pd Cl Cl C N C H H H H O H
charge: 0.116774 0.127163 -0.056409 -0.166729 0.010851 0.098464 0.029913 0.016866 0.036431 0.027587 0.038260 0.038670 0.031270 0.081597 0.036907 -0.086430 -0.023527 0.018551 -0.086287 -0.320815 -0.325978 -0.276269 0.201947 0.085509 0.080081 0.081420 0.082435 0.017008 -0.116741 0.201480
chargesum: 0.00000
title: Mulliken charges with hydrogens summed into heavy atoms:
elementType: C C C C C C C C Pd Cl Cl C N C O
charge: 0.184947 0.182700 -0.039401 -0.130298 0.069707 0.216968 -0.086430 -0.004976 -0.086287 -0.320815 -0.325978 -0.276269 0.201947 0.329444 0.084740
1716.lowfreq: -418.3300 -2.1907 -0.0030 -0.0029 -0.0026 3.7697 5.7505 18.1444 31.1890
frequency: -418.3299 18.1111 31.1871 31.5718 41.6298 78.6302 103.5716 109.9252 118.2873 141.4191 158.9948 167.7662 195.0263 205.0275 217.4431 235.6296 245.2324 263.7559 294.8687 310.5023 347.2561 368.2792 424.4443 428.4601 436.0096 449.8231 453.7965 546.7758 561.8251 660.2029 685.4738 706.0586 814.7839 849.6917 883.3111 887.3263 930.7111 942.8013 968.1202 982.0057 999.4642 1014.3358 1024.8989 1025.3791 1031.8586 1039.3926 1073.3057 1078.9939 1132.7667 1141.0774 1165.7441 1200.1091 1224.2803 1255.3966 1287.7366 1296.5032 1312.5405 1369.5735 1370.7395 1406.4674 1419.2391 1419.8921 1430.0991 1443.7535 1466.4686 1503.0879 1613.3584 1735.5487 2466.5375 3100.0956 3117.2750 3120.0410 3123.0000 3137.0848 3163.0525 3173.0407 3175.6508 3190.5958 3202.2408 3209.4028 3210.6290 3249.6615 3275.9237 3830.8069
redmass: 9.6675 1.0116 4.4548 4.8333 7.5585 6.7226 6.0024 3.8084 5.4887 4.6507 8.3447 8.0331 3.5305 5.2895 4.5267 5.0412 2.5444 7.9136 4.2745 27.3283 3.2040 15.5692 2.9893 4.1991 2.8017 2.8581 2.4704 2.2573 1.1651 2.2614 2.6180 3.0296 1.4378 2.2456 1.5552 1.5131 1.8412 1.6761 2.0129 3.6668 1.5221 1.2114 1.4780 1.4755 1.3090 1.2061 1.3379 1.2868 1.4000 1.2113 1.1938 1.5497 1.5347 1.2398 1.4321 1.2219 1.7494 1.2737 1.3120 1.2695 1.0361 1.0364 1.2520 1.1658 1.7632 3.0077 6.4454 5.4261 12.6228 1.0355 1.0615 1.0867 1.0604 1.0586 1.0700 1.0874 1.0903 1.1042 1.1098 1.1051 1.1054 1.1165 1.1167 1.0655
irintensity: 725.0752 0.0035 7.8292 9.0775 0.0436 0.5755 2.2582 0.4711 6.1597 5.2481 4.1142 1.4944 0.2987 2.3872 0.6633 9.9888 7.3369 1.4918 18.0865 0.6079 42.2562 42.8409 14.4378 3.4888 2.3883 6.2694 9.8718 14.1941 102.9849 11.0494 6.6272 41.3583 13.9460 12.7095 46.0519 28.7722 68.3720 23.5063 13.9809 0.3121 40.1224 28.3796 6.2720 5.1084 5.0563 35.6133 21.1877 25.1213 14.6621 23.5123 82.6195 3.9558 26.6301 44.3964 6.3109 32.9615 76.8512 4.7476 0.1596 4.2245 12.4807 12.8238 21.7046 5.8210 22.3134 50.6951 296.6778 8.3847 11.5334 0.1920 12.2186 15.9068 6.4325 10.0506 0.3101 24.4102 11.1066 1.8379 2.8029 0.7473 0.8720 2.5787 3.8713 130.4153
temp: 298.150 k
press: 1.00000 atm
elementType: 6 6 6 6 6 6 1 1 1 1 1 1 1 1 1 6 6 1 46 17 17 6 7 6 1 1 1 1 8 1
symmnumber: 1
zpe: 613222.4 jmol-1
zpe.correction: 0.233564 hartree
zpe.thermalcorrener: 0.252380 hartree
zpe.thermalcorrenthalpy: 0.253324 hartree
zpe.thermalcorrgfe: 0.183456 hartree
zpe.sumelectzpe: -1566.241684 hartree
zpe.sumelectthermal: -1566.222869 hartree
zpe.sumelectthermalent: -1566.221925 hartree
zpe.sumelectthermalfe: -1566.291792 hartree
dipole: -1.5353 -0.5401 -2.6866
dipole: 3.1412
quadrupole: -58.0690 -133.5009 -110.8046
quadrupole: 1.1830 0.4386 1.1447
quadrupole: 42.7225 -32.7094 -10.0131 1.1830 0.4386 1.1447
hfenergy: -1566.4752484 hartree
pointgroup: C01 [X(C10H15Cl2N1O1Pd1)]
dipole: 0.6855885 0.4084184 -0.9436297 debye
polarizability: 264.4293678|14.1258989|176.9895211|14.5611248|7.1522863|124.2093218 unknown
InChI: InChI=1S/C8H12O.C2H3N.2ClH.Pd/c1-3-5-7-8(9)6-4-2;1-2-3;;;/h3-4,6,9H,1-2,5,7H2;1H3;2*1H;/q;;;;+2/p-2
charge 0 multiplicity 1
30 atoms
C  1.84452543 0.76469446 1.81181792
C  0.26406799 0.79799638 1.81778751
C  2.66655422 -1.44960024 -0.17302255
C  -0.22163325 -0.25236014 0.8654829
C  1.93776388 -2.56891724 -0.12286642
C  0.21924717 -0.0483766 -0.49258182
H  2.1968908 -0.21396339 2.16493694
H  -0.06364252 1.7972958 1.49639957
H  -0.09318205 -1.27737045 1.23352414
H  0.85348777 -2.60692296 -0.27696578
H  2.23207491 1.57008977 2.44963209
H  -0.08550496 0.6299579 2.84555583
H  2.42918376 -3.51845303 0.10416564
H  0.09206 -0.86059148 -1.21762148
H  0.06703402 0.96380337 -0.88987172
C  2.22935373 0.97581396 0.40778522
C  2.20960931 -0.06657393 -0.51874504
H  2.41745262 0.23827688 -1.55683375
Pd -2.18521351 -0.25802929 0.22305335
Cl -1.95017966 -2.56086914 -0.00573943
Cl -2.27747291 2.05756633 0.2464527
C  -5.28642447 -0.3938096 -0.64861764
N  -4.17233133 -0.34717993 -0.35496734
C  -6.691908 -0.45221425 -1.01772714
H  -6.79339738 -0.83188456 -2.04302619
H  -7.22929981 -1.12312677 -0.33449505
H  -7.13553091 0.55050115 -0.96015493
H  3.74587338 -1.5284856 0.01120022
O  2.24085402 2.24684958 0.02944602
H  2.37387248 2.32924575 -0.92935884
