program: Gaussian 16
title: min nm2166_B irc ( for irc NM1549 (sub 2.17 from nm1243 for ts(from scan nm1140 freeze 1 2 at 2.2 and scan 5 6 (took nm1128.com andchanged both to p(ch3)2))))
version: ES64L-G16RevC.01
frameworkgroup: C1[X(C11H17Cl2NOPd)]
method: RMN15
basis: def2SVP
operation: Freq
keyword: #N
keyword: Geom=AllCheck
keyword: Guess=TCheck
keyword: SCRF=Check
keyword: GenChk
keyword: RMN15/def2SVPFreq
keyword: RMN15/def2SVP
keyword: Freq
title: min nm2166_B irc ( for irc NM1549 (sub 2.17 from nm1243 for ts (from s
converged: YES YES NO NO
title: Mulliken charges:
elementType: C C C C C C H H H H H H H H C H C H Pd Cl Cl C N H C H H H O C H H H
charge: 0.036813 0.034055 0.052680 -0.147039 0.091984 0.116027 0.042653 0.074925 0.036314 0.013750 0.032243 0.021627 0.028268 0.026820 -0.035346 0.033274 -0.031891 -0.012507 -0.112669 -0.314715 -0.356764 -0.278803 0.199499 0.081310 0.085819 0.079349 0.081448 0.079270 -0.246030 0.146694 0.053447 0.050936 0.036557
chargesum: -0.00000
title: Mulliken charges with hydrogens summed into heavy atoms:
elementType: C C C C C C C C Pd Cl Cl C N C O C
charge: 0.111710 0.190289 0.052680 -0.110725 0.127361 0.171116 -0.002073 -0.044397 -0.112669 -0.314715 -0.356764 -0.278803 0.199499 0.325886 -0.246030 0.287634
chargesum: 0.00000
1716.lowfreq: -555.1539 -0.0026 -0.0021 0.0008 1.4219 3.5282 7.1980 16.0727 29.4027
frequency: -555.1539 16.0523 29.3998 31.0148 42.1479 59.3555 94.9375 102.8396 115.7987 141.7083 164.7058 179.5258 203.2731 207.9246 220.8974 238.1074 249.1728 256.7574 263.6699 270.7123 286.5614 297.7380 330.9347 359.8134 369.2736 383.2701 427.4114 430.4963 447.7059 535.9158 616.3175 639.4622 682.3214 773.7857 776.1647 802.1105 856.0259 879.4662 923.9138 935.3003 954.8489 979.8859 1013.5949 1024.7024 1025.7692 1033.5387 1041.9537 1049.6960 1069.8415 1113.5874 1118.0170 1157.0114 1167.9497 1187.2571 1199.2433 1232.2184 1264.1527 1286.7131 1313.9612 1342.0530 1362.0615 1370.6971 1385.4202 1406.1871 1419.8129 1420.2747 1428.1832 1435.4228 1445.2477 1454.3885 1460.0910 1464.1765 1498.0492 1594.3145 1630.7321 2464.1475 3069.4072 3099.9311 3105.4652 3112.0244 3152.3297 3165.8560 3167.7951 3173.3131 3178.9418 3189.0696 3201.5653 3208.9541 3210.1724 3227.2036 3252.9991 3284.7644 3304.5420
redmass: 9.8942 1.0184 4.2730 4.9691 7.5665 7.0886 4.9436 9.1639 5.2510 7.2836 7.6290 3.9306 5.9041 4.1250 3.8051 3.4009 4.4438 1.2488 4.7863 4.6259 4.4425 4.4445 3.6314 5.4196 3.0074 2.8464 4.1938 2.5521 3.4074 3.0086 2.8696 2.8324 2.5796 1.9908 1.6959 1.7449 1.4828 1.5339 1.6700 1.3954 1.5491 3.8400 1.5107 1.4775 1.4759 1.4021 2.2792 1.3168 1.5215 1.5291 2.2064 1.3156 1.3709 1.2126 1.2937 1.5853 1.3994 1.2759 1.3367 1.3986 1.5489 1.3116 1.2851 1.4603 1.0362 1.0365 1.1144 1.1542 1.5615 1.0642 1.1389 1.3670 2.2256 4.2936 4.5856 12.6196 1.0343 1.0355 1.0629 1.0633 1.0926 1.0996 1.0586 1.1085 1.1020 1.0825 1.0695 1.1050 1.1054 1.1046 1.0900 1.1157 1.1120
irintensity: 1647.9629 0.0650 6.1627 6.6066 1.6368 2.7189 1.4874 3.2666 7.5216 2.8135 6.4488 5.2059 2.3242 7.1314 9.7988 0.4047 4.7903 1.3950 1.3124 14.0506 3.5101 0.7336 10.1317 28.0280 8.1223 4.7224 0.8385 3.4925 3.1110 6.1977 34.2075 9.2855 5.9052 46.7581 39.9077 5.4401 36.3729 8.0097 101.4847 71.0265 75.3270 0.3202 4.2913 5.5031 5.0311 3.3038 9.1655 3.2338 31.2361 4.2741 25.4514 28.3597 68.2977 22.2444 14.0044 13.0608 13.1029 66.8801 3.7246 18.1227 71.5395 0.0870 9.1202 82.9406 12.4469 12.2951 9.8094 11.5063 14.3338 1.0230 11.3207 6.8467 77.6975 524.1615 309.1939 10.8013 53.6408 0.3797 11.1193 23.7028 4.8174 5.3426 5.8849 4.3697 7.5367 2.8586 3.8021 0.6595 0.6583 7.0586 5.0597 5.7742 3.8236
temp: 298.150 k
press: 1.00000 atm
elementType: 6 6 6 6 6 6 1 1 1 1 1 1 1 1 6 1 6 1 46 17 17 6 7 1 6 1 1 1 8 6 1 1 1
symmnumber: 1
zpe: 691211.4 jmol-1
zpe.correction: 0.263269 hartree
zpe.thermalcorrener: 0.283254 hartree
zpe.thermalcorrenthalpy: 0.284198 hartree
zpe.thermalcorrgfe: 0.211770 hartree
zpe.sumelectzpe: -1605.416201 hartree
zpe.sumelectthermal: -1605.396216 hartree
zpe.sumelectthermalent: -1605.395272 hartree
zpe.sumelectthermalfe: -1605.467699 hartree
dipole: -2.7225 -3.6639 2.0819
dipole: 5.0170
quadrupole: -81.8554 -121.6491 -119.5292
quadrupole: -20.1707 0.7947 2.3411
quadrupole: 25.8225 -13.9712 -11.8513 -20.1707 0.7947 2.3411
hfenergy: -1605.6794694 hartree
pointgroup: C01 [X(C11H17Cl2N1O1Pd1)]
dipole: -1.0334423 -1.3040663 1.0618004 debye
polarizability: 291.9687073|-3.1275776|196.9724528|-29.2987971|4.0134182|151.405993 unknown
InChI: InChI=1S/C9H14O.C2H3N.2ClH.Pd/c1-4-6-8-9(10-3)7-5-2;1-2-3;;;/h4-5,7H,1-2,6,8H2,3H3;1H3;2*1H;/q;;;;+2/p-2
charge 0 multiplicity 1
33 atoms
C  -2.48272903 2.43247468 1.1492502
C  -0.83808395 1.43383994 0.77830087
C  -3.53107788 -0.24777451 -0.13365911
C  -0.69682084 1.2920162 -0.66382207
C  -3.16624497 0.61935732 -1.30358998
C  -1.65783887 0.52101415 -1.58161994
H  -2.65545089 2.73608886 0.11895155
H  -0.99942274 0.52207654 1.35661021
H  -0.39450242 2.24556545 -1.11603513
H  -3.52697705 1.64738568 -1.1683249
H  -2.21840155 3.25790213 1.81438096
H  -3.70630528 0.19390356 -2.16264546
H  -1.47472647 0.8800254 -2.60481849
H  -1.40830711 -0.54994769 -1.57439595
C  -3.16499872 1.36216525 1.73658949
H  -3.18460548 1.37827142 2.8331648
C  -3.61576119 0.13516398 1.19149398
H  -3.92823049 -0.61680265 1.91647593
Pd 1.02966339 0.20083875 -0.39589917
Cl 2.20141105 2.08180603 -1.01391406
Cl -0.23492618 -1.6626021 0.36179256
C  3.76594551 -1.52067886 -0.18673276
N  2.78649126 -0.9138002 -0.23634822
H  -0.13724504 2.14277164 1.23282567
C  5.00420896 -2.28142075 -0.12656167
H  4.78305579 -3.3557504 -0.07741672
H  5.60963425 -2.07896182 -1.01998631
H  5.57701712 -1.99211768 0.76446616
O  -3.74140155 -1.48766607 -0.52690696
C  -3.76732308 -2.55573919 0.40295283
H  -3.81878369 -3.47732943 -0.18629197
H  -2.83742639 -2.54040379 0.99320121
H  -4.64984847 -2.49300782 1.05842149
