program: Gaussian 09
title: 000038047
version: EM64L-G09RevD.01
frameworkgroup: C1[X(C14H16N2O2)]
method: RPBEPBE
basis: SDD
operation: Freq
keyword: #p
keyword: freq=noraman
keyword: PBEPBE/SDD
title: #p freq=noraman PBEPBE/SDD
converged: YES YES NO NO
title: Mulliken charges:
elementType: O O N N C C C C C C C C C C C C C C H H H H H H H H H H H H H H H H
charge: -0.235256 -0.237671 -0.245902 -0.635553 -0.380956 -0.381035 -0.387560 -0.387569 -0.393931 0.246469 0.281860 0.090852 0.159739 -0.360311 0.081185 -0.352577 -0.283381 -0.228447 0.186621 0.230191 0.230218 0.186820 0.201175 0.196374 0.196349 0.201195 0.217938 0.189718 0.229011 0.261468 0.327688 0.335277 0.226371 0.233632
chargesum: 0.00000
title: Mulliken charges with hydrogens summed into heavy atoms:
elementType: O O N N C C C C C C C C C C C C C C
charge: -0.235256 -0.237671 -0.245902 0.027412 0.035856 0.036002 0.009990 0.009975 0.013725 0.246469 0.281860 0.090852 0.159739 -0.131301 0.081185 -0.091109 -0.057010 0.005185
polarizability: 2.04930056e+02 -1.65595118e+01 2.32370679e+02 2.18738281e-02 -1.55079173e-02 1.00356125e+02
1716.lowfreq: -11.6116 -0.0007 -0.0005 0.0006 2.6294 10.0923 21.5506 56.7381 66.6276
frequency: 20.2059 56.2890 66.5291 100.2297 112.0767 175.4215 201.9367 202.7505 228.9345 286.2123 289.3576 308.0853 333.6612 370.6383 374.7325 425.8764 438.7458 446.3058 459.4271 476.3974 491.9744 534.4951 574.3145 619.6637 632.2985 635.4976 646.2950 669.2457 721.4303 749.1647 760.7627 762.7019 802.0225 832.1253 849.6879 858.5285 882.4500 890.6038 909.6525 940.0688 951.6291 978.3028 991.9037 1027.4817 1036.8068 1069.6037 1077.6984 1081.1778 1103.5971 1118.2185 1126.1698 1142.9370 1167.7800 1187.4064 1195.3910 1221.3021 1251.5398 1260.8483 1265.8941 1304.3716 1328.2487 1334.7223 1341.9161 1346.2382 1346.7390 1366.2960 1376.5572 1399.9447 1446.9154 1450.3010 1457.8387 1463.0853 1467.5474 1472.8410 1478.3450 1534.2643 1570.2110 1602.9095 1614.1903 1643.0507 2876.7566 2884.2996 2967.9247 2980.8393 2981.2199 3035.8562 3040.5234 3044.9399 3045.2670 3053.5037 3137.2145 3154.4545 3171.5894 3179.8369 3511.8384 3674.7655
redmass: 3.1402 3.5442 4.7720 5.7296 6.4822 2.9380 3.4217 4.0068 2.1744 3.3029 5.4600 3.3532 3.5523 4.4312 2.2929 6.4362 2.8966 5.1479 3.1869 2.6301 1.2355 4.0213 3.4444 1.4674 7.0356 2.4377 4.1117 6.3400 6.0906 3.1797 4.5564 1.5460 1.4696 2.7930 1.4897 1.4233 5.9273 3.8550 2.3285 1.3655 1.3241 1.3075 2.8116 2.1771 2.1230 2.0302 1.4451 6.5279 1.8679 3.0880 2.1564 1.2022 1.1710 2.2553 2.3913 2.1477 1.3939 1.4342 1.1826 1.6955 1.2543 1.3810 1.7907 1.4440 2.2223 1.4894 2.9085 7.5522 2.6725 1.0929 1.0889 1.1153 1.0768 1.7348 1.4375 1.6273 4.0411 5.9689 9.3324 8.4174 1.0702 1.0692 1.0636 1.0600 1.0621 1.0959 1.0937 1.0976 1.0925 1.1026 1.0860 1.0905 1.0944 1.0984 1.0430 1.1054
irintensity: 0.0392 0.0601 0.2962 2.5509 0.0956 0.2975 0.6070 0.5762 0.0199 2.9656 0.5989 10.8852 3.5310 4.7117 9.2800 0.7909 0.3362 0.2418 0.3918 0.7251 226.9446 0.0519 2.7971 9.0892 0.3757 16.1077 6.3857 2.5854 3.6107 22.5714 6.6284 73.4593 0.4473 1.2342 9.4930 0.8747 13.7137 9.5005 4.5272 0.9204 3.6483 0.1842 13.6508 13.9964 6.1622 1.7284 9.1813 128.5011 33.4821 7.5407 0.8971 5.7000 1.3129 25.9806 19.2514 18.9032 4.6160 1.9735 10.3950 6.0242 3.3493 0.3994 11.3697 0.2250 12.0832 1.9133 12.1818 28.2189 16.4515 6.9169 17.8469 19.6774 1.3645 0.5903 3.5944 196.9632 41.5824 96.9796 356.7210 343.9057 37.1013 86.4645 34.8168 37.5452 28.6366 71.3347 69.8173 0.2509 1.2553 83.9434 3.5112 13.4180 20.2290 14.5480 109.1742 83.2629
temp: 298.150 k
press: 1.00000 atm
elementType: 8 8 7 7 6 6 6 6 6 6 6 6 6 6 6 6 6 6 1 1 1 1 1 1 1 1 1 1 1 1 1 1 1 1
symmnumber: 1
zpe: 726610.8 jmol-1
zpe.correction: 0.276751 hartree
zpe.thermalcorrener: 0.292218 hartree
zpe.thermalcorrenthalpy: 0.293162 hartree
zpe.thermalcorrgfe: 0.233579 hartree
zpe.sumelectzpe: -801.733512 hartree
zpe.sumelectthermal: -801.718045 hartree
zpe.sumelectthermalent: -801.717101 hartree
zpe.sumelectthermalfe: -801.776684 hartree
dipole: -4.5973 -3.0740 0.0010
dipole: 5.5304
quadrupole: -104.2355 -106.5531 -107.3510
quadrupole: -14.3816 -0.0006 -0.0042
quadrupole: 1.8110 -0.5066 -1.3045 -14.3816 -0.0006 -0.0042
hfenergy: -802.010263 hartree
pointgroup: C01 [X(C14H16N2O2)]
dipole: -1.643653 1.4256475 0.0097032 debye
polarizability: 209.454451|19.4308988|227.8163798|0.8679901|1.8435055|100.3860282 unknown
InChI: InChI=1S/C14H16N2O2/c15-12-13(16-8-4-1-5-9-16)10-6-2-3-7-11(10)18-14(12)17/h2-3,6-7H,1,4-5,8-9,15H2
charge 0 multiplicity 1
34 atoms
O  2.486203 -1.468303 -0.005458
O  1.638972 -3.608312 -0.039573
N  -1.551919 0.020521 -0.007092
N  -0.981793 -2.710776 -0.040757
C  -2.074595 0.626605 1.246602
C  -2.060288 0.656171 -1.252261
C  -3.617421 0.573952 1.259692
C  -3.602742 0.603872 -1.284477
C  -4.200352 1.242115 -0.008141
C  -0.172886 -0.410387 -0.005041
C  0.973318 0.487895 0.013129
C  0.043135 -1.793168 -0.022705
C  2.288122 -0.070526 0.012551
C  0.884351 1.913898 0.031656
C  1.402627 -2.377218 -0.023673
C  3.453182 0.717642 0.029431
C  2.039353 2.714629 0.048743
C  3.329446 2.121016 0.047795
H  -1.752372 1.690295 1.36283
H  -1.658281 0.064194 2.101358
H  -1.633648 0.114226 -2.115087
H  -1.736891 1.722285 -1.338897
H  -3.992692 1.076065 2.172188
H  -3.941379 -0.484554 1.30316
H  -3.92606 -0.453247 -1.356851
H  -3.967464 1.127515 -2.189125
H  -5.303317 1.158541 -0.015459
H  -3.96006 2.32576 0.005911
H  -0.101333 2.386676 0.032503
H  4.427974 0.221124 0.027909
H  -1.934784 -2.34873 -0.041191
H  -0.761037 -3.704507 -0.053011
H  1.942999 3.805517 0.062798
H  4.226731 2.747915 0.061145
