program: Gaussian 16
title: Title Card Required
version: ES64L-G16RevC.01
frameworkgroup: C1[X(C12H20Cl2N2Pd)]
method: RMN15
basis: def2SVP
operation: Freq
keyword: #N
keyword: Geom=AllCheck
keyword: Guess=TCheck
keyword: SCRF=Check
keyword: GenChk
keyword: RMN15/def2SVP
keyword: Freq
converged: YES YES YES YES
title: Mulliken charges:
elementType: C C C C C C H H H H H H H C H C H Pd Cl Cl C N H H C H H H N C H H H C H H H
charge: 0.005568 0.103969 -0.086524 -0.171989 0.102480 0.102252 0.007915 0.044728 0.079546 0.010999 0.015060 -0.015390 0.034778 0.058766 0.002082 0.030495 0.021878 -0.118012 -0.317589 -0.301180 -0.277466 0.201120 0.047214 0.004212 0.086184 0.081617 0.077696 0.082977 -0.295531 0.110536 0.021700 0.030885 0.028477 0.101681 0.033203 0.028287 0.027378
chargesum: -0.00000
title: Mulliken charges with hydrogens summed into heavy atoms:
elementType: C C C C C C C C Pd Cl Cl C N C N C C
charge: 0.013483 0.152909 -0.039309 -0.092443 0.128539 0.121640 0.060848 0.052373 -0.118012 -0.317589 -0.301180 -0.277466 0.201120 0.328473 -0.295531 0.191599 0.190548
1716.lowfreq: -526.7605 -6.9895 -2.8997 -0.0014 -0.0006 -0.0002 5.3703 23.3459 27.2246
frequency: -526.7603 23.3092 27.1883 29.4548 42.0779 69.3420 76.3748 84.0050 109.9945 119.3227 143.2359 157.9951 161.6243 166.5178 175.9537 206.8917 215.2801 220.1075 228.0267 246.9828 248.6374 268.4700 297.9082 321.8985 328.3655 346.2882 369.6697 405.9446 420.7287 430.8097 443.3167 475.3435 516.6414 537.4314 599.5114 670.3813 744.5932 765.3893 805.3048 833.2375 862.0969 871.8345 910.6619 932.2612 964.6778 978.6429 980.3744 992.9839 1024.6706 1025.4191 1039.0079 1052.2432 1069.1294 1082.8824 1095.8787 1105.5259 1130.9284 1138.3452 1146.2032 1196.3303 1229.5885 1237.7228 1264.3195 1286.1575 1310.9058 1331.3209 1354.1243 1370.4835 1372.3083 1392.3987 1413.6856 1419.3621 1420.0853 1421.4043 1430.5284 1434.8968 1442.3807 1449.4624 1453.5778 1457.2528 1477.5517 1494.3098 1609.7515 1627.2373 2464.7294 2951.6059 3018.0274 3034.6786 3048.2413 3074.9826 3100.1127 3111.6994 3118.7480 3140.5091 3146.6420 3167.2663 3181.7780 3194.1169 3209.3146 3210.5450 3211.2911 3227.5676 3233.7567 3243.0567 3269.5643
redmass: 4.4737 1.0458 3.5580 4.5210 4.8339 3.0023 7.0204 5.4907 6.8629 6.5837 4.2919 2.8956 4.2430 10.3391 1.5976 1.5122 3.1283 3.5228 3.8023 2.7024 3.5232 3.4825 8.7061 3.2442 5.6567 3.6712 7.8521 2.7009 3.5318 2.9609 4.5266 2.4889 3.1882 3.1852 2.0579 2.6831 1.3476 1.5120 1.2637 1.8894 2.3760 1.4201 2.5529 2.1702 1.3439 2.1318 1.6578 1.2954 1.4759 1.4770 1.6849 1.4743 1.3511 1.3839 1.5357 1.2540 1.4479 1.3794 1.5225 1.3071 1.2102 1.2052 1.6656 1.2124 1.6863 1.2888 1.6520 1.3148 2.2389 2.0672 1.1951 1.0362 1.0365 1.1423 1.2656 1.0685 1.1424 1.2637 1.6054 1.3939 1.1281 1.3356 5.8652 4.2859 12.6205 1.0842 1.0473 1.0410 1.0724 1.0684 1.0355 1.1032 1.0907 1.0592 1.0978 1.1041 1.1015 1.0939 1.1051 1.1053 1.0872 1.0913 1.0915 1.0890 1.1127
irintensity: 124.3740 0.2105 3.0455 7.2858 4.7353 2.4919 0.2301 7.7232 7.4148 8.9157 2.4859 0.4195 6.5281 2.5298 0.5954 0.2266 1.1838 3.1102 5.9889 3.9160 8.7380 26.7424 2.4845 3.9630 6.8823 28.5644 18.3849 8.6933 0.2872 7.9600 1.3657 3.8365 6.4824 17.2422 9.2186 11.1992 5.7698 71.0153 15.5246 11.5049 4.2288 72.9308 5.2298 5.0846 23.4308 1.4663 9.6002 0.9760 5.0623 4.9088 1.6743 4.9354 23.6256 20.9612 20.1550 12.1637 45.9534 4.8259 6.5752 11.6416 1.1936 5.0198 16.7461 2.8303 4.9124 1.5343 3.8311 0.7699 32.1149 93.2604 7.0629 11.9058 12.8035 11.6610 6.0034 33.2845 27.6795 9.3963 9.1928 21.4839 5.7653 109.5802 64.9843 163.3201 11.4358 3.7462 55.5271 41.4497 51.1396 36.4636 0.2484 26.3523 33.9423 12.5261 10.5249 15.1145 16.7406 1.2844 0.6473 0.9678 4.0856 3.5800 1.4683 2.8223 1.1384
temp: 298.150 k
press: 1.00000 atm
elementType: 6 6 6 6 6 6 1 1 1 1 1 1 1 6 1 6 1 46 17 17 6 7 1 1 6 1 1 1 7 6 1 1 1 6 1 1 1
symmnumber: 1
zpe: 789491.7 jmol-1
zpe.correction: 0.300702 hartree
zpe.thermalcorrener: 0.322699 hartree
zpe.thermalcorrenthalpy: 0.323644 hartree
zpe.thermalcorrgfe: 0.247339 hartree
zpe.sumelectzpe: -1624.739285 hartree
zpe.sumelectthermal: -1624.717287 hartree
zpe.sumelectthermalent: -1624.716343 hartree
zpe.sumelectthermalfe: -1624.792648 hartree
dipole: 1.1590 -2.2772 1.9548
dipole: 3.2172
quadrupole: -85.7684 -134.1658 -131.3581
quadrupole: 18.9884 -8.9636 -2.7841
quadrupole: 31.3290 -17.0684 -14.2607 18.9884 -8.9636 -2.7841
hfenergy: -1625.0399862 hartree
pointgroup: C01 [X(C12H20Cl2N2Pd1)]
dipole: 0.4553529 -0.8901443 0.7761296 debye
polarizability: 297.3053827|-7.8565296|201.0365918|-8.8504312|-3.166893|158.8101566 unknown
InChI: InChI=1S/C10H17N.C2H3N.2ClH.Pd/c1-4-5-6-7-8-9-10-11(2)3;1-2-3;;;/h4,7-10H,1,5-6H2,2-3H3;1H3;2*1H;/q;;;;+2/p-2
charge 0 multiplicity 1
37 atoms
C  2.90037555 -0.02751812 0.64038328
C  1.8846979 0.23692025 -1.15795812
C  0.1826779 1.27708476 1.57240199
C  0.67866801 0.99479813 -1.10806678
C  0.88961378 2.45273182 0.92758145
C  0.85521157 2.42411067 -0.61531544
H  3.0813027 1.04683407 0.71561116
H  1.84498176 -0.78800435 -1.53625917
H  0.05870585 0.83316998 -2.02260347
H  1.92329953 2.49749501 1.31096682
H  0.39772838 3.36994386 1.2805807
H  1.78268202 2.86198812 -1.02850204
H  0.01240236 3.033866 -0.95850654
C  1.87538919 -0.58881357 1.41862188
H  1.92646169 -1.6647221 1.60088147
C  0.69643507 0.029412 1.87749379
H  0.02865333 -0.6256643 2.44433105
Pd -1.08218836 0.07997784 -0.3366146
Cl -0.14464495 -2.05498766 -0.58570733
Cl -2.24338679 2.09686432 -0.22224193
C  -3.91436852 -1.37304291 0.25835584
N  -2.89762005 -0.86279967 0.06931402
H  -0.78872586 1.50831205 2.01732602
H  2.78784429 0.80598311 -1.40619129
C  -5.19972031 -2.01329699 0.48960708
H  -5.35123434 -2.81903272 -0.2408106
H  -5.23127535 -2.4385503 1.50143369
H  -6.00702389 -1.27649006 0.38470762
N  4.02543532 -0.75850868 0.29323631
C  3.89266542 -2.19683669 0.17884814
H  4.7133511 -2.59289849 -0.43396013
H  3.93764038 -2.69524124 1.1620344
H  2.93087299 -2.47568951 -0.29231509
C  5.04911757 -0.11835328 -0.49723448
H  6.04226863 -0.52441604 -0.25061908
H  4.89758302 -0.23725998 -1.58834085
H  5.07002111 0.95899066 -0.27449677
