program: Gaussian 16
title: ts
version: ES64L-G16RevA.03
frameworkgroup: C1[X(C6AuCl2F3I3)]
method: RwB97XD
basis: Gen
operation: Freq
keyword: #N
keyword: Geom=AllCheck
keyword: Guess=TCheck
keyword: SCRF=Check
keyword: GenChk
keyword: RwB97XD/ChkBasFreq
converged: YES YES YES YES
title: Mulliken charges:
elementType: Cl Cl F F F C C C C C C Au I I I
charge: 0.158552 0.158552 -0.196268 -0.196268 -0.209475 -0.497933 0.462823 0.462823 -0.419742 0.407687 -0.419742 -0.095754 -0.350105 0.095023 -0.360171
chargesum: -1.00000
title: Mulliken charges with hydrogens summed into heavy atoms:
1716.lowfreq: -164.1270 -3.9234 0.0011 0.0012 0.0013 1.6053 4.7874 11.0902 32.4785
frequency: -164.1209 10.7125 32.4745 35.5420 53.1810 60.9913 65.0079 84.7929 111.1137 111.2780 114.2663 130.9149 150.1601 154.9869 199.5001 224.8861 242.0579 289.1804 307.0112 330.7150 377.9621 395.4890 403.8802 586.6555 619.8445 644.1445 670.3234 715.1033 741.3666 771.6004 1077.9331 1101.8793 1136.6272 1328.7735 1418.0248 1486.0537 1498.2281 1656.8233 1667.7747
redmass: 20.7153 62.2901 44.8853 37.6511 68.0347 112.2020 58.4316 37.2714 23.6963 22.3493 20.6455 83.7975 66.4182 116.8692 23.9752 15.6498 21.7917 13.5222 21.6875 22.6365 12.4580 19.8636 18.1818 17.3340 12.3588 13.3797 12.1827 12.7736 12.0578 14.1272 13.2008 13.6173 12.6749 12.0047 12.6454 12.3596 12.2669 12.0169 12.0431
irintensity: 88.3930 0.0880 0.3449 0.1709 2.9095 0.1023 0.4591 0.4845 0.2690 0.9076 0.0004 5.0679 11.1506 15.0819 7.5744 29.5124 0.0217 44.5092 1.0547 0.5103 0.0258 0.2392 0.0823 4.4376 57.2693 61.0893 0.0828 2.7290 1.8338 102.2308 57.1934 14.2888 8.8421 5.0773 32.1735 190.7296 171.4560 12.8604 11.8365
temp: 298.150 k
press: 1.00000 atm
elementType: 17 17 9 9 9 6 6 6 6 6 6 79 53 53 53
symmnumber: 1
zpe: 125651.3 jmol-1
zpe.correction: 0.047858 hartree
zpe.thermalcorrener: 0.065383 hartree
zpe.thermalcorrenthalpy: 0.066327 hartree
zpe.thermalcorrgfe: -0.005905 hartree
zpe.sumelectzpe: -1618.023382 hartree
zpe.sumelectthermal: -1618.005857 hartree
zpe.sumelectthermalent: -1618.004913 hartree
zpe.sumelectthermalfe: -1618.077144 hartree
dipole: 4.9631 -5.5395 0.0002
dipole: 7.4376
quadrupole: -205.7650 -175.6518 -172.3370
quadrupole: 1.2739 -0.0008 0.0001
quadrupole: -21.1804 8.9328 12.2476 1.2739 -0.0008 0.0001
hfenergy: -1618.0712397 hartree
pointgroup: C01[X(C6Au1Cl2F3I3)]
dipole: 2.0539596 -2.0841878 0.0000756 debye
dipolederiv: -0.3210045 -0.0223569 -0.260423 -0.0878562 -0.0558723 -0.0824224 -0.3825466 -0.0300674 -0.5326624 -0.3210346 -0.0223505 0.2604337 -0.087848 -0.055869 0.0824035 0.3825591 0.030052 -0.5326359 -0.1902293 -0.1727124 0.2786456 -0.1003852 -0.0509662 0.1181505 0.0816687 0.2098474 -0.7959455 -0.1902127 -0.1727105 -0.2786125 -0.1003825 -0.0509758 -0.1181766 -0.0816376 -0.2098768 -0.795953 -1.3471251 -0.1332544 -0.0000246 -0.4132896 -0.1876481 -0.0000093 -0.0000211 -0.0000029 -0.1804024 0.4876835 0.2867213 0.0000145 -0.5184963 1.5577385 -0.0000371 0.0000239 -0.0000165 -0.3009132 -0.0183526 0.1808727 -0.2817696 -0.0498883 0.0684501 -0.0982431 -0.0426034 -0.3202104 0.7741105 -0.0183678 0.1808638 0.2817281 -0.0498918 0.068462 0.0982606 0.0425684 0.3202381 0.7741125 0.2621852 0.0270023 -0.4281433 0.2120112 -0.1519811 -0.1693981 -0.5874407 -0.0382839 0.5980314 1.0747124 0.1966946 0.000017 0.2736365 0.3056489 0.0000036 0.0000161 0.0000023 0.1738867 0.2621367 0.0270132 0.4281272 0.2120216 -0.151975 0.1694316 0.5874193 0.0383086 0.598072 0.5624567 0.5938248 0.0000069 0.3664898 0.279237 0.0000042 0.0000112 0.0000075 -0.0717708 -0.3004496 -0.3801737 0.000006 0.1659798 -1.1199779 0.0000138 -0.0000012 0.0000016 -0.3410812 0.3524481 -0.7138171 0.0000166 0.2556573 -1.1403728 0.0000214 0.0000037 -0.0000016 0.0346254 -1.2948464 0.124383 -0.0000224 -0.0777582 -0.3138983 -0.0000027 -0.0000199 0.0000021 -0.4014741 unknown
polarizability: 287.3973249|3.0383697|225.8687264|0.0027692|-0.0005453|165.3300573 unknown
InChI: InChI=1S/C6Cl2F3I.Au.2HI/c7-1-3(9)2(8)5(11)6(12)4(1)10;;;/h;;2*1H/q;+2;;/p-2
charge -1 multiplicity 1
15 atoms
Cl 3.93440794 0.16632966 2.73308712
Cl 3.93453599 0.16624594 -2.73291163
F  1.19135753 -0.84507035 2.35435109
F  1.19146699 -0.84513971 -2.35427305
F  5.0015621 0.56568399 0.00010672
C  1.10585335 -0.833093 0.00003676
C  1.80117141 -0.61414505 1.19240881
C  1.80122693 -0.61418002 -1.1923093
C  3.10116054 -0.13767904 -1.2029304
C  3.74968869 0.10881687 0.00008437
C  3.10110423 -0.13764258 1.20307621
Au -0.96269354 0.14823911 -0.00002217
I  0.15113495 2.65414489 -0.00002988
I  -0.36068746 -2.6300748 0.00002521
I  -3.69141264 0.09155008 -0.00008784
