program: Gaussian 09
title: 000038043
version: EM64L-G09RevD.01
frameworkgroup: C1[X(C23H29ClO5)]
method: RPBEPBE
basis: SDD
operation: Freq
keyword: #p
keyword: freq=noraman
keyword: PBEPBE/SDD
title: #p freq=noraman PBEPBE/SDD
converged: YES YES NO NO
title: Mulliken charges:
elementType: Cl O O O O O C C C C C C C C C C C C C C C C C C C C C C C H H H H H H H H H H H H H H H H H H H H H H H H H H H H H
charge: -0.073866 -0.423911 -0.170741 -0.347179 -0.460032 -0.186425 0.297521 -0.138445 -0.568074 0.109891 0.448674 -0.727319 -0.703707 -0.334020 -0.827605 -0.484241 -0.538087 0.443489 -0.264651 -0.625283 -0.847377 0.133271 -0.057384 0.291467 0.185948 0.501824 -0.623046 -0.840009 -0.253920 0.234344 0.267476 0.275998 0.243316 0.230219 0.237102 0.238457 0.220557 0.252632 0.215637 0.284240 0.213790 0.214067 0.213045 0.206702 0.222166 0.202705 0.225276 0.273542 0.198370 0.219768 0.233366 0.250635 0.244523 0.251838 0.241685 0.181578 0.360019 0.430183
chargesum: 0.00000
title: Mulliken charges with hydrogens summed into heavy atoms:
elementType: Cl O O O O O C C C C C C C C C C C C C C C C C C C C C C C
charge: -0.073866 -0.423911 -0.170741 0.012840 -0.029849 -0.186425 0.297521 0.095899 -0.024600 0.109891 0.448674 -0.016681 0.007940 -0.118383 -0.115508 -0.064493 -0.113216 0.443489 -0.039376 -0.153371 -0.143607 0.133271 -0.057384 0.291467 0.185948 0.501824 -0.623046 -0.101964 -0.072342
polarizability: 3.44180819e+02 5.54756440e+00 3.30937746e+02 -2.19203062e+01 1.27052143e+00 1.91855408e+02
1716.lowfreq: -30.3028 -8.8198 -6.0816 -0.0015 0.0002 0.0010 6.0401 12.8207 28.2565
frequency: -29.2793 12.3459 28.1167 49.6341 57.5225 60.6759 62.5974 67.8828 69.8324 76.4487 86.1484 94.6100 101.7833 108.9233 120.1562 146.0641 161.3626 172.9553 182.0874 187.5528 190.8560 216.0911 218.1794 225.2854 230.2012 240.0059 247.0731 262.0315 287.7324 292.5918 320.1648 327.6929 335.9557 350.1946 354.7696 361.4171 367.3409 381.8951 390.4386 394.9498 403.3478 420.1975 441.6371 475.4108 477.8474 507.9299 516.3841 543.8423 548.3624 566.6813 578.2485 588.1495 594.2634 627.3603 645.7626 660.7324 681.2653 688.2596 744.4904 771.6279 777.7272 798.6426 803.3912 811.8891 821.8579 857.6196 865.9192 890.8853 898.6392 909.1806 932.7840 937.2824 942.4289 947.1760 963.6101 974.7461 983.7678 996.9640 1006.7006 1018.9179 1031.3616 1038.6282 1041.7694 1045.4691 1047.4358 1062.6095 1074.7008 1089.2484 1100.9863 1139.9190 1149.8523 1155.4842 1158.7488 1188.0113 1191.1851 1198.6215 1206.9696 1212.6739 1232.6604 1235.5514 1239.4858 1254.9210 1278.8951 1285.0130 1294.8375 1326.6217 1332.7634 1336.2788 1362.4004 1374.6017 1377.6433 1383.6412 1392.0729 1396.1429 1398.7380 1401.1986 1409.7117 1420.9927 1426.7785 1450.1290 1453.4599 1455.7685 1460.7688 1466.9765 1467.6774 1470.6567 1472.3118 1472.7151 1478.9178 1481.3098 1483.5287 1487.8888 1488.1122 1555.7857 1580.8333 1615.1027 1666.4241 1674.4106 1685.1267 2901.4831 2926.0913 2949.3720 2964.2770 2971.8759 2979.9717 2985.7517 2989.5319 2992.7902 2997.3593 2999.8037 3011.5813 3030.1288 3031.8979 3034.6179 3047.5850 3055.1866 3068.6605 3073.4231 3084.2716 3087.2194 3087.6231 3093.1185 3100.0774 3101.6323 3109.3677 3112.8118 3120.6920 3530.8211
redmass: 1.8830 9.5508 5.1234 5.3865 3.5109 5.1121 3.1867 3.1242 2.6026 2.8337 5.5814 1.9759 1.2972 2.1885 4.9816 3.5002 3.7086 3.4841 3.2936 1.8939 1.0994 2.5160 4.6852 1.5253 2.5459 3.1989 3.6612 3.0955 3.3244 3.1754 2.5129 9.5329 2.4611 3.2823 3.2674 3.6277 4.1472 3.6391 3.9419 4.9032 2.1673 2.1150 3.1667 2.8659 3.3680 3.4969 2.1893 2.4557 3.0382 4.8058 3.3862 4.1142 4.1057 4.9985 4.0303 7.3574 5.1106 4.0748 2.8975 3.1248 2.6501 2.4503 1.8695 2.0996 3.0189 1.8219 1.6928 2.6834 2.6521 2.1775 2.0169 1.7536 2.1162 2.4475 1.8342 1.6932 2.0842 1.6155 2.6983 1.8928 1.6299 1.5562 1.6589 1.7631 1.9788 2.8518 3.0069 3.5027 2.3038 1.4768 1.4942 1.6571 1.6406 2.8998 1.7326 1.2614 1.6016 1.6656 2.0660 1.8904 1.6004 2.1472 1.3331 1.5150 1.3303 1.5236 2.2872 3.3005 1.4274 1.2351 1.2520 2.8887 1.2023 1.2758 1.6032 1.3179 2.8178 1.0909 1.8774 3.1123 1.0655 1.0778 1.0818 1.0495 1.0848 1.0774 1.0811 1.0753 1.0842 1.1058 1.0824 1.0515 1.0504 7.8279 6.5082 6.4955 11.6767 6.9050 7.2727 1.0815 1.0712 1.0771 1.0390 1.0604 1.0378 1.0616 1.0734 1.0469 1.0397 1.0352 1.0631 1.0901 1.0941 1.0992 1.0973 1.0970 1.0918 1.0977 1.0981 1.0991 1.0963 1.0973 1.0907 1.0998 1.1008 1.1000 1.0958 1.0647
irintensity: 0.0879 0.2108 1.6406 2.0308 0.7192 6.9380 2.2491 1.2292 1.0916 2.0379 1.7043 3.6173 1.4654 3.3745 7.3662 0.6801 2.5795 3.4051 0.7013 0.7392 0.3405 1.8138 6.8788 0.9695 6.3663 2.4913 4.9609 2.6281 1.0009 11.9959 1.3975 4.5589 23.6213 13.8542 8.8255 1.8900 3.0027 2.3486 4.6476 1.6780 38.3672 17.8862 7.3323 2.0512 3.0702 16.7878 5.6671 10.6047 3.6239 7.0751 9.4117 3.8809 6.6135 2.8620 7.6234 14.6251 50.8665 13.2493 16.2769 3.1621 13.7801 46.8595 70.6007 18.4974 1.0257 58.3711 58.6841 17.1466 7.0646 32.1466 14.4987 14.1183 57.6388 15.2475 2.0454 2.1246 2.6254 2.3918 2.4779 9.4100 7.3358 2.9070 3.0165 13.6026 11.7619 89.7734 171.3612 95.1202 45.9336 10.7832 109.0325 21.6390 43.1592 20.7579 100.8541 11.1902 27.0345 383.0889 30.7512 2.0928 2.3507 1.4609 2.5549 16.4438 0.7296 0.5572 22.8776 36.2017 1.0337 28.2741 0.5660 1.7742 34.4451 24.9862 45.1733 29.4106 5.7358 14.9432 31.8035 33.9855 3.0027 13.4714 16.3254 0.8701 4.2377 9.1009 14.0424 10.0174 31.6625 25.2835 8.9627 9.5801 9.6790 62.1083 502.1363 57.6044 179.7400 3.9932 4.5619 138.0463 54.8933 1904.3503 38.2689 23.6672 43.2811 87.3778 37.4023 32.0482 22.0863 9.7514 5.8550 16.1534 12.2642 20.5860 20.5596 16.1106 40.2088 12.0367 3.3833 19.0617 22.2125 30.6204 20.4170 14.4791 2.9451 4.7114 7.2507 33.2126
temp: 298.150 k
press: 1.00000 atm
elementType: 17 8 8 8 8 8 6 6 6 6 6 6 6 6 6 6 6 6 6 6 6 6 6 6 6 6 6 6 6 1 1 1 1 1 1 1 1 1 1 1 1 1 1 1 1 1 1 1 1 1 1 1 1 1 1 1 1 1
symmnumber: 1
zpe: 1223570.7 jmol-1
zpe.correction: 0.466033 hartree
zpe.thermalcorrener: 0.497051 hartree
zpe.thermalcorrenthalpy: 0.497995 hartree
zpe.thermalcorrgfe: 0.403573 hartree
zpe.sumelectzpe: -1727.794580 hartree
zpe.sumelectthermal: -1727.763563 hartree
zpe.sumelectthermalent: -1727.762619 hartree
zpe.sumelectthermalfe: -1727.857041 hartree
dipole: -5.6915 2.2927 -0.6030
dipole: 6.1655
quadrupole: -233.3487 -161.3416 -175.1661
quadrupole: -17.2823 8.6367 5.2907
quadrupole: -43.3965 28.6105 14.7860 -17.2823 8.6367 5.2907
hfenergy: -1728.2606137 hartree
pointgroup: C01 [X(C23H29Cl1O5)]
dipole: 0.9383292 2.2367082 0.0249223 debye
polarizability: 329.570943|2.8391697|332.1040645|-45.1616326|-18.1859187|205.298965 unknown
InChI: InChI=1S/C23H29ClO5/c1-13(7-6-8-14(2)18-11-19(26)23(4,5)29-18)9-10-16-21(27)17(12-25)15(3)20(24)22(16)28/h8-9,12,18,27-28H,6-7,10-11H2,1-5H3
charge 0 multiplicity 1
58 atoms
Cl 1.792985 -2.852476 -0.882872
O  2.206174 0.876042 -0.612158
O  5.472011 2.253262 -1.209102
O  -3.97197 -2.290524 0.758335
O  -0.00984 -0.397905 -1.222233
O  -3.879015 -4.855342 1.666638
C  3.642835 0.604728 -0.933224
C  2.104875 2.131793 0.232797
C  3.303734 2.987431 -0.242911
C  4.301868 2.001201 -0.84601
C  0.755666 2.805984 0.057796
C  3.728858 0.020068 -2.34926
C  4.278591 -0.305069 0.144977
C  0.104752 3.243127 1.176561
C  0.269534 2.996972 -1.364748
C  -1.162412 4.068593 1.247378
C  -2.439528 3.232114 1.618525
C  -2.857914 2.296938 0.492355
C  -2.511918 0.98079 0.533016
C  -2.694849 -0.036499 -0.594602
C  -3.595547 2.934741 -0.671307
C  -1.989122 -1.348417 -0.298246
C  -2.646225 -2.424603 0.350114
C  -0.61034 -1.477139 -0.611496
C  -1.986806 -3.664762 0.634042
C  -0.602677 -3.812974 0.263614
C  0.039789 -2.717089 -0.342803
C  0.142602 -5.11733 0.51214
C  -2.673075 -4.797913 1.297123
H  2.245149 1.834764 1.291322
H  3.00251 3.703475 -1.030405
H  3.766785 3.574181 0.567715
H  3.28329 -0.987639 -2.381738
H  3.19429 0.663487 -3.069005
H  4.78828 -0.042736 -2.652825
H  5.352236 -0.443525 -0.072315
H  4.184921 0.13622 1.153908
H  3.777218 -1.286407 0.147591
H  0.542269 2.98306 2.154701
H  -0.158683 2.048079 -1.737507
H  -0.50954 3.773127 -1.436352
H  1.090097 3.271159 -2.053867
H  -1.033913 4.848799 2.024191
H  -1.344046 4.59962 0.294916
H  -2.230381 2.655631 2.53942
H  -3.254718 3.945749 1.85532
H  -1.984768 0.607763 1.422622
H  -2.268704 0.375081 -1.527486
H  -3.771231 -0.207897 -0.820169
H  -3.045133 3.810473 -1.068366
H  -4.585732 3.30989 -0.344438
H  -3.760267 2.235326 -1.507384
H  -0.348599 -5.966154 0.004548
H  1.173879 -5.056645 0.136548
H  0.193264 -5.356897 1.589534
H  -2.014973 -5.681825 1.472209
H  -4.298397 -1.37391 0.564249
H  0.941261 -0.132188 -0.953674
