program: Gaussian 16
title: ts
version: ES64L-G16RevA.03
frameworkgroup: C1[X(C12AuCl4F6I2)]
method: RwB97XD
basis: Gen
operation: Freq
keyword: #N
keyword: Geom=AllCheck
keyword: Guess=TCheck
keyword: SCRF=Check
keyword: GenChk
keyword: RwB97XD/ChkBasFreq
converged: YES YES YES YES
title: Mulliken charges:
elementType: Cl Cl F F F C C C C C C Au C C C C C C F F F Cl Cl I I
charge: 0.170967 0.163681 -0.180328 -0.198157 -0.205826 -0.306306 0.446306 0.373059 -0.437260 0.402916 -0.431601 0.063576 -0.306306 0.373059 0.446306 -0.437260 -0.431601 0.402916 -0.180328 -0.198157 -0.205826 0.163681 0.170967 -0.329239 -0.329239
chargesum: -1.00000
title: Mulliken charges with hydrogens summed into heavy atoms:
1716.lowfreq: -289.5789 -0.0011 -0.0009 -0.0007 2.9682 4.8255 5.0718 18.9683 26.3310
frequency: -289.5787 18.9458 26.3304 29.9145 35.1940 38.3379 46.3130 50.1715 84.3392 99.5101 105.1223 116.1092 117.8041 122.9813 127.1962 145.5846 149.9231 159.8252 166.5574 205.8514 207.1117 233.8582 235.3360 249.7864 261.1978 267.3014 307.1469 315.3288 330.3114 347.8858 371.6907 373.0649 391.9409 393.8461 400.2379 411.3039 415.0169 586.7195 589.6874 611.3525 637.7605 662.7081 667.4235 678.3892 682.9072 712.1499 738.2152 751.5599 763.6563 775.3596 780.6850 1081.3760 1081.8730 1101.5739 1104.2549 1139.4227 1140.8375 1320.8297 1322.9933 1406.6471 1409.8817 1485.8321 1487.9999 1493.0772 1493.3220 1646.4871 1651.4263 1670.6152 1674.3419
redmass: 13.7818 61.1814 42.8702 27.0404 34.0700 27.8556 63.0350 38.7879 25.5909 23.4034 22.0263 25.7766 27.7761 22.9534 36.3535 20.2895 40.6685 51.1670 30.5510 22.5850 22.7876 14.8539 17.2986 20.5533 20.3020 14.0770 21.5693 21.6747 21.8053 23.9944 12.7561 12.6154 15.3785 15.5243 19.0494 18.0482 18.0359 17.3197 17.1535 12.5644 13.5362 12.1713 12.4559 12.2193 12.8895 12.8331 12.4986 12.2703 12.1118 14.0099 13.9817 13.2547 13.1310 13.5293 13.5936 12.7293 12.6404 12.0340 12.0187 12.6569 12.6139 12.2936 12.3150 12.3205 12.3536 12.0162 12.0163 12.0441 12.0359
irintensity: 104.2246 0.0121 0.2469 0.0493 0.1205 0.0020 1.1510 0.2991 0.0559 0.0645 0.0571 0.3329 0.2810 1.7002 2.1491 0.0432 6.0856 8.6965 5.2436 1.3366 16.5345 6.4645 2.4868 0.1655 0.1516 6.9680 0.0551 2.1083 1.1335 0.0021 0.1214 0.4903 1.0486 4.2655 0.0098 0.0365 0.4208 9.3224 0.4152 12.8839 65.6887 1.9366 11.5213 1.7812 24.1515 10.1339 0.1505 1.6932 6.2126 179.2106 10.8452 99.5460 78.9370 17.9282 1.7344 0.0001 0.8493 9.2494 2.4266 2.4368 0.0312 77.9381 251.0354 241.3349 52.5538 9.8875 0.0614 21.8400 49.4526
temp: 298.150 k
press: 1.00000 atm
elementType: 17 17 9 9 9 6 6 6 6 6 6 79 6 6 6 6 6 6 9 9 9 17 17 53 53
symmnumber: 1
zpe: 249479.7 jmol-1
zpe.correction: 0.095022 hartree
zpe.thermalcorrener: 0.120666 hartree
zpe.thermalcorrenthalpy: 0.121610 hartree
zpe.thermalcorrgfe: 0.032967 hartree
zpe.sumelectzpe: -3054.821232 hartree
zpe.sumelectthermal: -3054.795587 hartree
zpe.sumelectthermalent: -3054.794643 hartree
zpe.sumelectthermalfe: -3054.883286 hartree
dipole: 0.0000 -7.7835 0.0000
dipole: 7.7835
quadrupole: -252.3219 -256.0548 -230.6671
quadrupole: 0.0000 1.9263 0.0000
quadrupole: -5.9740 -9.7069 15.6809 0.0000 1.9263 0.0000
hfenergy: -3054.9162533 hartree
pointgroup: C01 [X(C12Au1Cl4F6I2)]
dipole: -0.000093 3.0622591 -0.0001439 debye
dipolederiv: -0.3397603 0.1218656 0.286342 0.0566481 -0.0765859 -0.0293435 0.3770244 -0.1207494 -0.4676923 -0.1599354 0.137876 -0.1328034 0.1724643 -0.2798694 0.2597979 -0.2314557 0.3356516 -0.4691241 -0.2097371 0.1317934 -0.0537354 0.0291664 -0.2535429 0.3040611 0.0200255 0.2594156 -0.6374532 -0.3265881 0.0063084 0.3057168 0.0229311 -0.0497976 0.0074468 0.176322 0.1650418 -0.6959549 -0.9949256 0.6257107 0.0171926 0.6611516 -0.611947 -0.0098375 0.027999 -0.0056759 -0.1745859 0.1942666 0.6978428 0.0172994 -0.0460373 0.5799486 0.100779 0.0132698 0.2282151 -0.2088614 0.2269652 -0.0027001 0.0574309 -0.0162647 0.1868557 -0.3052361 0.004133 -0.1983991 0.5681507 0.2081511 0.049921 -0.2789503 0.0214392 0.0659634 0.0108206 -0.1626957 -0.2214597 0.682158 0.0280278 -0.2034823 0.2585881 -0.2421032 0.1756378 -0.3977174 0.3931681 -0.5146301 0.5014942 0.8334081 -0.4544249 0.001281 -0.5242431 0.5866916 0.0308869 0.0350214 0.034535 0.2160278 0.3047224 -0.1666857 -0.494189 0.034655 -0.1194456 0.084899 -0.6421968 0.1566092 0.5373524 0.9071577 0.0000382 0.2672084 0.0000333 0.0649696 0.0000075 0.174061 0.0000038 0.0383875 0.1943063 -0.6978646 0.0173712 0.0460151 0.5798785 -0.1008519 0.0132795 -0.2282879 -0.2088304 0.2081554 -0.0499385 -0.2789449 -0.0214458 0.0659787 -0.0107798 -0.1627074 0.2215074 0.6821379 0.226964 0.0027079 0.0574121 0.0162675 0.1869039 0.3052754 0.0041193 0.1984351 0.5681037 0.0280008 0.2034975 0.2585448 0.242131 0.1757503 0.3977636 0.3931141 0.5146844 0.5014088 0.3047145 0.1666653 -0.4941997 -0.0346894 -0.1194601 -0.0848675 -0.6421841 -0.1565866 0.537375 0.8333487 0.45444 0.0012404 0.5242614 0.5867449 -0.0309215 0.0349746 -0.0345675 0.2160339 -0.2097274 -0.1317957 -0.0537043 -0.0291616 -0.2536055 -0.3041007 0.0200441 -0.2594503 -0.6374006 -0.3265863 -0.0062965 0.3057178 -0.0229313 -0.0498157 -0.0074888 0.1763343 -0.1650917 -0.6959385 -0.9948474 -0.6257327 0.0172507 -0.6611717 -0.6120214 0.0098794 0.0280606 0.0057179 -0.174587 -0.1599165 -0.1378809 -0.1327743 -0.1724786 -0.2799439 -0.2598237 -0.2314192 -0.3356831 -0.469068 -0.3397495 -0.1218548 0.2863517 -0.0566287 -0.0765827 0.0293243 0.3770224 0.1207355 -0.4677063 -0.7181834 -0.5774078 -0.1177941 -0.2135003 -0.7363873 -0.0666322 -0.097642 -0.1576746 -0.370703 -0.7182316 0.5773975 -0.1178524 0.2134918 -0.7363183 0.0666592 -0.0976719 0.1577036 -0.3707242 unknown
polarizability: 318.2858663|0.0004208|292.5054309|-7.7228202|-0.0029317|235.3706656 unknown
InChI: InChI=1S/C12Cl4F6.Au.2HI/c13-3-7(17)1(8(18)4(14)11(3)21)2-9(19)5(15)12(22)6(16)10(2)20;;;/h;;2*1H/q;+2;;/p-2
charge -1 multiplicity 1
25 atoms
Cl -3.86683718 1.86313086 2.57891881
Cl -2.97231986 3.24535958 -2.62646718
F  -1.49722358 0.21870813 2.1619523
F  -0.67176734 1.48226031 -2.31205299
F  -4.32636742 3.25458317 0.00770504
C  -0.92786056 0.83738724 -0.05497009
C  -1.74782934 0.95982162 1.08441568
C  -1.37200085 1.54474378 -1.18046463
C  -2.49842425 2.35388866 -1.17382838
C  -3.2495837 2.47174082 -0.01493779
C  -2.87497803 1.76595716 1.11871108
Au 0.00003768 -1.11236589 0.00008507
C  0.92781753 0.8374487 0.0549577
C  1.37191476 1.54493749 1.18038609
C  1.74777902 0.95982616 -1.08443942
C  2.49828906 2.3541501 1.17367425
C  2.8748788 1.76602687 -1.11881014
C  3.24944151 2.47193936 0.01477272
F  1.49721838 0.21859656 -2.16190667
F  0.6716849 1.48251741 2.3119802
F  4.32617772 3.25484492 -0.00794326
Cl 2.97213041 3.24578571 2.62622966
Cl 3.86673227 1.86312404 -2.57902682
I  -2.17699106 -2.67227421 -0.54404187
I  2.17716112 -2.67209054 0.54435965
