program: Gaussian 09
title: 000038035
version: EM64L-G09RevD.01
frameworkgroup: C1[X(C12H7Cl3)]
method: RPBEPBE
basis: SDD
operation: Freq
keyword: #pfreq=noraman
keyword: PBEPBE/SDD
title: #p freq=noraman PBEPBE/SDD
converged: NO YES NO NO
title: Mulliken charges:
elementType: Cl Cl Cl C C C C C C C C C C C C H H H H H H H
charge: 0.007420 -0.012838 -0.053064 0.389608 0.282321 -0.290846 -0.377134 -0.343798 -0.343861 -0.078987 -0.212428 -0.200710 -0.200723 -0.235044 -0.107150 0.257620 0.250711 0.250710 0.240651 0.257563 0.257562 0.262419
chargesum: 0.00000
title: Mulliken charges with hydrogens summed into heavy atoms:
elementType: Cl Cl Cl C C C C C C C C C C C C
charge: 0.007420 -0.012838 -0.053064 0.389608 0.282321 -0.290846 -0.119514 -0.093087 -0.093151 -0.078987 0.028223 0.056853 0.056839 0.027375 -0.107150
polarizability: 2.28832667e+02 -1.10697467e+01 1.33828164e+02 -1.04474657e-02 -2.51637989e-02 9.88233870e+01
1716.lowfreq: -39.0450 -2.8278 -0.0023 -0.0013 0.0006 2.6072 7.2093 41.1161 47.3270
frequency: -39.0372 41.1161 47.2888 117.6035 137.2810 191.7709 206.3627 217.8475 255.6599 295.6859 342.1036 366.1787 403.8416 410.8688 450.8415 473.9377 505.2470 548.3370 568.0148 625.8343 669.2748 709.6196 722.9448 727.2468 778.9000 790.8761 829.6534 830.1473 904.7570 950.6422 965.7174 974.7790 992.1948 1007.0006 1044.5685 1072.7682 1105.1438 1106.0609 1150.3029 1184.4380 1195.8324 1288.8953 1290.7726 1349.9352 1351.5732 1386.7507 1398.5626 1434.5044 1482.5246 1557.6160 1576.3847 1589.1793 1603.2859 3144.3553 3144.8583 3146.0467 3160.1394 3170.6957 3174.1691 3176.5576
redmass: 4.1003 14.4608 15.5219 7.2750 9.8298 27.2836 5.0614 10.9200 7.1562 8.7395 4.7138 9.1891 2.9005 7.5836 6.8532 8.9256 4.0047 3.3173 5.2544 6.8843 7.6907 5.9886 4.3175 2.9268 6.2246 1.5616 1.5734 1.2440 1.3679 1.3328 1.3676 1.3362 6.9714 4.8914 4.6326 2.5636 1.3670 1.8042 1.7042 1.1219 1.3743 2.3359 1.2509 9.9933 5.5903 3.5632 2.9189 2.3234 2.8971 6.5298 7.7011 7.0264 6.7326 1.0871 1.0895 1.0894 1.0929 1.0959 1.0971 1.0995
irintensity: 0.1398 0.2193 0.0000 0.0630 0.6156 0.0138 0.1583 0.2075 3.7257 0.1044 1.8393 7.0358 0.0349 10.3005 0.0733 11.0657 0.0224 28.7486 0.0019 0.0006 14.5406 16.9263 4.0352 19.7500 63.8271 49.0322 45.2182 0.2363 0.0097 0.3106 0.0673 0.5250 8.8913 62.0398 18.9758 39.8732 8.5362 4.3465 17.0058 0.8614 5.7029 1.7926 0.2836 3.4195 0.3627 5.6696 50.3322 67.7941 45.7270 16.3954 1.1269 3.2001 16.8437 4.5640 3.9086 4.4700 5.3635 6.3067 0.2804 8.2576
temp: 298.150 k
press: 1.00000 atm
elementType: 17 17 17 6 6 6 6 6 6 6 6 6 6 6 6 1 1 1 1 1 1 1
symmnumber: 1
zpe: 390852.9 jmol-1
zpe.correction: 0.148868 hartree
zpe.thermalcorrener: 0.161131 hartree
zpe.thermalcorrenthalpy: 0.162076 hartree
zpe.thermalcorrgfe: 0.108596 hartree
zpe.sumelectzpe: -1840.620320 hartree
zpe.sumelectthermal: -1840.608056 hartree
zpe.sumelectthermalent: -1840.607112 hartree
zpe.sumelectthermalfe: -1840.660592 hartree
dipole: -1.0107 3.1494 0.0013
dipole: 3.3076
quadrupole: -114.7763 -103.7151 -101.5400
quadrupole: -7.0378 -0.0048 -0.0111
quadrupole: -8.0991 2.9620 5.1371 -7.0378 -0.0048 -0.0111
hfenergy: -1840.7691878 hartree
pointgroup: C01 [X(C12H7Cl3)]
dipole: -0.4834259 -1.20818 -0.0002437 debye
dipolederiv: -0.1655272 -0.1935206 -0.0000488 -0.1966893 -0.5864866 -0.0001119 -0.0000029 -0.0001017 -0.0233876 -0.4735123 0.3190676 0.0000454 0.404261 -0.404562 -0.0000606 0.0000603 -0.0000506 -0.0377925 -0.931833 -0.0798631 -0.0000064 -0.0992602 -0.0770776 0.000065 -0.0000138 0.0000619 -0.1270055 0.394278 -0.017575 -0.0000414 -0.0681492 -0.1286511 0.0000411 -0.000069 -0.0000071 -0.0444381 0.2686723 -0.0266684 0.0000273 0.013316 -0.0624561 -0.0000381 -0.0000683 0.0000272 -0.0278998 -0.0663534 0.3534955 0.0000946 0.4386403 0.7400804 0.0001851 0.0000676 0.0001394 -0.0375418 -0.1786908 -0.0189826 -0.0000229 -0.0438634 0.0270785 0.0000461 -0.0000303 0.0000409 -0.1307549 -0.0732154 0.0173799 0.0560459 -0.0035501 -0.1002362 -0.0135078 -0.0905311 -0.0054362 0.0830537 -0.0731092 0.0174924 -0.0559892 -0.0039305 -0.1003503 0.0130811 0.0906149 0.0050498 0.083076 0.5641362 -0.5023754 -0.00008 -0.7111394 0.4455608 0.0000598 -0.0001503 0.0000643 -0.0337358 0.0291901 0.0036151 0.0000009 0.0215187 0.0811941 0.000024 0.0001215 0.0000485 -0.1406093 -0.3543332 -0.0184129 -0.0831973 -0.0182433 -0.1011654 -0.0113345 -0.0626611 -0.0083523 -0.0052536 -0.3543972 -0.0185867 0.0832023 -0.0182987 -0.1012139 0.0111125 0.062767 0.0081044 -0.0052637 -0.1124647 0.0627264 0.000017 0.1613674 -0.1707177 -0.0000081 0.0000402 -0.0000049 -0.108877 1.3403034 0.1448986 0.0000313 0.1627196 -0.0511418 -0.0002181 -0.0000119 -0.0002076 0.1256715 0.0363897 0.0872495 0.0000048 0.0972945 0.0004611 -0.0000376 0.0000043 -0.0000102 0.1400186 0.0471961 -0.016335 -0.0843511 -0.0130804 0.1306741 -0.004428 -0.0876496 -0.0052565 -0.017412 0.0472472 -0.0165412 0.0843293 -0.0132769 0.1306536 0.0048012 0.0876124 0.0055739 -0.0174376 0.0305345 -0.0538554 -0.0000096 -0.0658336 -0.0755516 -0.0000366 -0.0000211 -0.0000386 0.1606788 0.033151 -0.0107233 0.066418 -0.0164556 0.1586806 0.0083985 0.063357 0.0060149 -0.0005862 0.0331121 -0.0105777 -0.0664624 -0.0162867 0.1587163 -0.0080206 -0.0634052 -0.0056481 -0.0005906 -0.0407745 -0.0219078 -0.0000078 -0.01106 0.0865108 -0.0000126 -0.0000305 -0.0000113 0.1660875 unknown
polarizability: 229.9132942|4.3251778|132.7475243|0.0044679|-0.0336092|98.8234001 unknown
InChI: InChI=1S/C12H7Cl3/c13-9-6-4-8(5-7-9)10-2-1-3-11(14)12(10)15/h1-7H
charge 0 multiplicity 1
22 atoms
Cl -1.023672 2.342645 0.00032
Cl -4.236873 1.794333 0.000196
Cl 5.343946 0.307015 -0.000079
C  -0.752375 -0.440964 -0.000129
C  0.73493 -0.232652 -0.00011
C  -1.665568 0.646575 0.000035
C  -1.28001 -1.758243 -0.0003
C  1.449972 -0.148154 -1.221631
C  1.450287 -0.150989 1.221415
C  -3.060058 0.414775 -0.000006
C  -2.672612 -1.987612 -0.000338
C  2.853031 0.016551 -1.230224
C  2.853349 0.013711 1.23003
C  -3.570586 -0.899119 -0.000204
C  3.534102 0.094878 -0.000093
H  -0.579321 -2.599354 -0.000429
H  0.909946 -0.204494 -2.172807
H  0.910504 -0.209525 2.172597
H  -3.063021 -3.010078 -0.000494
H  3.402699 0.083659 -2.173584
H  3.403268 0.078643 2.173395
H  -4.653236 -1.055802 -0.000258
