program: Orca
programVersion: 4.2.1
elementType: S N N N C C C C C C C C C C H H H H H H H
charge: 0
multiplicity: 1
keywords: wb97x-d3
keywords: def2-TZVPP
keywords: def2/J RIJCOSX GRIDX6 NOFINALGRIDX
keywords: grid4 nofinalgrid
keywords: scfconv7
keywords: smallprint printgap noloewdin
keywords: NOSOSCF
formula: C10H7N3S
InChI: InChI=1S/C10H7N3S/c1-2-4-8-7(3-1)12-10(13-8)9-5-14-6-11-9/h1-6,12H
21 atoms
S  4.031754 0.499084 0.000242
N  -0.581979 1.140902 -0.000606
N  -0.631075 -1.083802 -0.000085
N  2.179025 -1.248868 -0.000549
C  -1.88476 0.716866 -0.000297
C  -1.940851 -0.689456 0.000045
C  0.125118 0.049234 -0.000447
C  1.57295 -0.025122 -0.00037
C  -3.066242 1.456077 -0.000244
C  -3.141115 -1.388718 0.000512
C  -4.262686 0.76727 0.000212
C  -4.299347 -0.634502 0.000605
C  2.416074 1.044727 0.000109
C  3.461912 -1.124212 -0.0001
H  -3.03504 2.537128 -0.000531
H  -3.176575 -2.470186 0.00081
H  -5.194763 1.316335 0.000273
H  -5.257191 -1.137307 0.000965
H  2.14741 2.088154 0.000319
H  4.146677 -1.960054 -0.000224
H  -0.25918 -2.018331 0.000063
totalener: -947.78456325 hartree
nucrepener: 883.83198509 hartree
electener: -1831.61654834 hartree
oneelecener: -3047.92838826 hartree
twoeener: 1216.31183992 hartree
kineticenergy: 944.87339682 hartree
xcener: -72.766649898125 hartree
chargesum: 0.0000000
charge: 0.094175 -0.303011 -0.142234 -0.346940 0.114548 0.071462 0.358239 0.038151 -0.194532 -0.175544 -0.116084 -0.114498 -0.139029 -0.031626 0.118234 0.114857 0.119193 0.119601 0.140510 0.125351 0.149175
qa: 0.0942 -0.3030 -0.1422 -0.3469 0.1145 0.0715 0.3582 0.0382 -0.1945 -0.1755 -0.1161 -0.1145 -0.1390 -0.0316 0.1182 0.1149 0.1192 0.1196 0.1405 0.1254 0.1492
va: 2.8023 3.1779 3.4224 3.0603 3.9028 3.7843 3.8524 3.7730 4.0724 4.0121 3.9335 3.9737 4.0659 4.0877 1.0156 1.0100 1.0013 1.0019 1.0232 1.0022 1.0437
dispcorr: -0.006640080 hartree
energy: -947.791203327280
dipole: -10.07404 10.88358 0.80954 -1.55443 0.83465 -0.71978 0.00181 -0.00121 0.00060
magnitude: 1.08326 au
magnitude: 2.75342 debye
