program: Orca
programVersion: 4.2.1
elementType: S N N N C C C C C C C C C C H H H H H H H
charge: 0
multiplicity: 1
keywords: wb97x-d3
keywords: def2-TZVPP
keywords: def2/J RIJCOSX GRIDX6 NOFINALGRIDX
keywords: grid4 nofinalgrid
keywords: scfconv7
keywords: smallprint printgap noloewdin
keywords: NOSOSCF
formula: C10H7N3S
InChI: InChI=1S/C10H7N3S/c1-2-4-8-7(3-1)12-10(13-8)9-5-14-6-11-9/h1-6,12H
21 atoms
S  4.031882 0.498892 -0.001122
N  -0.630865 -1.083524 0.000511
N  -0.582194 1.141198 0.000881
N  2.17875 -1.248596 0.000748
C  -1.940705 -0.689446 0.000149
C  -1.884904 0.716889 0.000396
C  0.125108 0.049659 0.000893
C  1.572943 -0.024714 0.000765
C  -3.140802 -1.388989 -0.000586
C  -3.066565 1.455823 -0.000053
C  -4.299203 -0.635045 -0.001129
C  -4.26285 0.766736 -0.000858
C  2.416322 1.044936 0.000234
C  3.461665 -1.124252 0.00006
H  -3.175994 -2.470465 -0.000826
H  -3.035635 2.536881 0.000112
H  -5.256931 -1.138068 -0.00176
H  -5.195052 1.315587 -0.001281
H  4.146211 -1.960271 -0.000188
H  -0.258746 -2.017966 0.000458
H  2.147937 2.088432 0.000103
totalener: -947.78456346 hartree
nucrepener: 883.83330139 hartree
electener: -1831.61786485 hartree
oneelecener: -3047.93092641 hartree
twoeener: 1216.31306156 hartree
kineticenergy: 944.87340743 hartree
xcener: -72.766651808926 hartree
chargesum: 0.0000000
charge: 0.094186 -0.142300 -0.302830 -0.346957 0.071455 0.114387 0.357951 0.038451 -0.175615 -0.194612 -0.114456 -0.116140 -0.138981 -0.031619 0.114935 0.118217 0.119729 0.119156 0.125358 0.149168 0.140520
qa: 0.0942 -0.1423 -0.3028 -0.3470 0.0715 0.1144 0.3580 0.0385 -0.1756 -0.1946 -0.1145 -0.1161 -0.1390 -0.0316 0.1149 0.1182 0.1197 0.1192 0.1254 0.1492 0.1405
va: 2.8023 3.4222 3.1783 3.0603 3.7843 3.9031 3.8528 3.7726 4.0121 4.0726 3.9734 3.9333 4.0659 4.0877 1.0100 1.0156 1.0019 1.0013 1.0022 1.0437 1.0231
dispcorr: -0.006640090 hartree
energy: -947.791203551355
dipole: -10.07362 10.88368 0.81006 -1.55584 0.83589 -0.71995 -0.00277 0.00178 -0.00099
magnitude: 1.08375 au
magnitude: 2.75469 debye
