program: Orca
programVersion: 4.2.1
elementType: O N N C C C C C C C C C C C H H H H H H H H
charge: 0
multiplicity: 1
keywords: wb97x-d3
keywords: def2-TZVPP
keywords: def2/J RIJCOSX GRIDX6 NOFINALGRIDX
keywords: grid4 nofinalgrid
keywords: scfconv7
keywords: smallprint printgap noloewdin
keywords: NOSOSCF
formula: C11H8N2O
InChI: InChI=1S/C11H8N2O/c1-2-5-9-8(4-1)12-11(13-9)10-6-3-7-14-10/h1-7,12H
22 atoms
O  -2.621811 -1.02559 0.000929
N  0.1892 -1.031598 -0.000706
N  0.231023 1.194798 -0.000151
C  1.512983 -0.686265 -0.000607
C  1.516805 0.718341 -0.000201
C  -0.523548 0.125746 -0.0002
C  -1.961564 0.156577 0.000163
C  2.68071 -1.438886 -0.000636
C  2.72839 1.408963 0.000381
C  3.872755 -0.734797 -0.000097
C  -2.847982 1.186177 -0.000463
C  3.896447 0.668479 0.000465
C  -4.140774 0.592904 0.000028
C  -3.942995 -0.746661 0.000721
H  -0.186517 -1.967942 0.000423
H  2.663773 -2.520574 -0.000985
H  2.750149 2.491199 0.001005
H  -2.60636 2.236648 -0.001655
H  4.850563 1.178855 0.001451
H  -5.09222 1.099035 -0.000672
H  -4.615265 -1.589341 0.001037
H  4.808057 -1.278756 0.000459
elementType: O N C H
totalener: -608.76557697 hartree
nucrepener: 799.51030334 hartree
electener: -1408.27588030 hartree
oneelecener: -2410.82633295 hartree
twoeener: 1002.55045264 hartree
cpcmener: -0.02398669 hartree
kineticenergy: 606.22380060 hartree
xcener: -58.904070982071 hartree
chargesum: -0.0000000
charge: -0.300185 -0.123733 -0.365571 0.078298 0.113699 0.371453 0.171241 -0.220688 -0.242018 -0.151408 -0.282299 -0.164635 -0.188418 -0.024679 0.187165 0.156851 0.142580 0.166523 0.159216 0.173750 0.182855 0.160003
qa: -0.3002 -0.1237 -0.3656 0.0783 0.1137 0.3715 0.1712 -0.2207 -0.2420 -0.1514 -0.2823 -0.1646 -0.1884 -0.0247 0.1872 0.1569 0.1426 0.1665 0.1592 0.1737 0.1829 0.1600
va: 2.2699 3.4511 3.1635 3.7370 3.8095 3.8921 3.4164 3.9454 4.0423 3.8778 3.9966 3.8819 3.9324 3.9078 1.0086 1.0000 1.0099 1.0152 0.9900 0.9963 0.9882 0.9901
dispcorr: -0.006806175 hartree
energy: -608.772383141438
dipole: 2.37433 -3.36220 -0.98787 -0.36572 -1.30017 -1.66589 0.00107 -0.00022 0.00084
magnitude: 1.93677 au
magnitude: 4.92287 debye
