program: Orca
programVersion: 4.2.1
elementType: O O N N N C C C C C C C C C H H H H H H H H H
charge: 0
multiplicity: 1
keywords: wb97x-d3
keywords: def2-TZVPP
keywords: def2/J RIJCOSX GRIDX6 NOFINALGRIDX
keywords: grid4 nofinalgrid
keywords: scfconv7
keywords: smallprint printgap noloewdin
keywords: NOSOSCF
formula: C9H9N3O2
InChI: InChI=1S/C9H9N3O2/c1-14-9(13)12-8-10-6-4-2-3-5-7(6)11-8/h2-5,10,12H,1H3
23 atoms
O  -3.793732 0.530198 -0.008155
O  -2.47729 -1.29514 0.01097
N  0.230275 -0.735088 -0.025137
N  0.639993 1.457865 -0.005318
N  -1.610753 0.81494 -0.037636
C  1.599929 -0.609599 -0.009822
C  1.834087 0.774078 0.002244
C  -0.269239 0.522427 -0.02135
C  2.622548 -1.544943 -0.009032
C  3.14137 1.251864 0.018534
C  3.918154 -1.050652 0.004532
C  4.172249 0.325959 0.018545
C  -2.626967 -0.092413 -0.008354
C  -4.966911 -0.285718 0.020324
H  -0.309849 -1.58668 -0.033855
H  2.423846 -2.60822 -0.018725
H  3.344731 2.31466 0.030186
H  4.749134 -1.743374 0.004327
H  5.197212 0.672826 0.029427
H  -5.009024 -0.890296 0.925281
H  -5.025117 -0.930256 -0.855729
H  -5.803935 0.40541 0.01217
H  -1.837499 1.800122 -0.037139
elementType: O N C H
totalener: -663.20565650 hartree
nucrepener: 844.82250361 hartree
electener: -1508.02816010 hartree
oneelecener: -2577.40333420 hartree
twoeener: 1069.37517410 hartree
cpcmener: -0.02771793 hartree
kineticenergy: 660.46928522 hartree
xcener: -62.562042169124 hartree
chargesum: 0.0000000
charge: -0.312468 -0.518072 -0.145177 -0.398249 -0.168791 0.031373 0.120755 0.350189 -0.195210 -0.251497 -0.168246 -0.156726 0.546667 -0.120104 0.197500 0.157636 0.141940 0.158676 0.158137 0.121350 0.120417 0.131199 0.198702
qa: -0.3125 -0.5181 -0.1452 -0.3982 -0.1688 0.0314 0.1208 0.3502 -0.1952 -0.2515 -0.1682 -0.1567 0.5467 -0.1201 0.1975 0.1576 0.1419 0.1587 0.1581 0.1213 0.1204 0.1312 0.1987
va: 2.1047 1.9794 3.4014 3.1146 3.2031 3.7795 3.8360 4.1248 3.9387 4.0463 3.8831 3.8713 4.2424 3.8541 1.0204 0.9991 1.0103 0.9910 0.9899 0.9923 0.9927 0.9947 1.0125
dispcorr: -0.007131483 hartree
energy: -663.212787978397
dipole: -2.23652 0.48647 -1.75006 -2.33003 1.80118 -0.52884 0.08167 -0.10070 -0.01903
magnitude: 1.82831 au
magnitude: 4.64721 debye
