program: Orca
programVersion: 4.2.1
elementType: O O N N N C C C C C C C C C H H H H H H H H H
charge: 0
multiplicity: 1
keywords: wb97x-d3
keywords: def2-TZVPP
keywords: def2/J RIJCOSX GRIDX6 NOFINALGRIDX
keywords: grid4 nofinalgrid
keywords: scfconv7
keywords: smallprint printgap noloewdin
keywords: NOSOSCF
formula: C9H9N3O2
InChI: InChI=1S/C9H9N3O2/c1-14-9(13)12-8-10-6-4-2-3-5-7(6)11-8/h2-5,10,12H,1H3
23 atoms
O  -3.794009 0.529911 0.000891
O  -2.463066 -1.279608 -0.002711
N  0.223066 -0.718209 -0.00236
N  0.64384 1.469774 0.000667
N  -1.611154 0.835351 -0.003008
C  1.591796 -0.60246 -0.000732
C  1.834661 0.780585 0.000711
C  -0.270642 0.541932 -0.00158
C  2.607769 -1.545012 -0.000269
C  3.145586 1.24927 0.001267
C  3.906571 -1.059318 0.000813
C  4.170028 0.315724 0.001204
C  -2.622021 -0.079006 -0.001265
C  -4.953038 -0.305078 0.002496
H  -0.325036 -1.564986 -0.003032
H  2.401569 -2.607393 -0.000205
H  3.356531 2.311107 0.001115
H  4.732762 -1.758339 0.001773
H  5.197885 0.654993 0.001485
H  -4.992708 -0.931398 0.893305
H  -4.994576 -0.931723 -0.887935
H  -5.802946 0.371503 0.003121
H  -1.839643 1.820362 0.000552
elementType: O N C H
totalener: -663.20886376 hartree
nucrepener: 845.55580755 hartree
electener: -1508.76467132 hartree
oneelecener: -2578.82426791 hartree
twoeener: 1070.05959659 hartree
cpcmener: -0.02379324 hartree
kineticenergy: 660.48273707 hartree
xcener: -62.563808315458 hartree
chargesum: 0.0000000
charge: -0.309492 -0.500464 -0.148423 -0.390347 -0.171793 0.030840 0.120835 0.349609 -0.191649 -0.247430 -0.164677 -0.151211 0.534021 -0.119640 0.194210 0.153422 0.139094 0.154291 0.154079 0.119786 0.119320 0.129683 0.195935
qa: -0.3095 -0.5005 -0.1484 -0.3903 -0.1718 0.0308 0.1208 0.3496 -0.1916 -0.2474 -0.1647 -0.1512 0.5340 -0.1196 0.1942 0.1534 0.1391 0.1543 0.1541 0.1198 0.1193 0.1297 0.1959
va: 2.1074 2.0003 3.3984 3.1190 3.2004 3.7837 3.8471 4.1220 3.9449 4.0518 3.8936 3.8756 4.2565 3.8590 1.0243 1.0001 1.0109 0.9925 0.9911 0.9929 0.9930 0.9947 1.0142
dispcorr: -0.007124678 hartree
energy: -663.215988441518
dipole: -2.23229 0.48485 -1.74744 -2.43656 1.91639 -0.52018 0.01185 -0.00907 0.00278
magnitude: 1.82322 au
magnitude: 4.63427 debye
