program: Orca
programVersion: 4.2.1
elementType: O O O N N N N C C C C C C C C C C C C C C H H H H H H H H H H H H H H H H H H
charge: 0
multiplicity: 1
keywords: wb97x-d3
keywords: def2-TZVPP
keywords: def2/J RIJCOSX GRIDX6 NOFINALGRIDX
keywords: grid4 nofinalgrid
keywords: scfconv7
keywords: smallprint printgap noloewdin
keywords: NOSOSCF
formula: C14H18N4O3
InChI: InChI=1S/C14H18N4O3/c1-3-4-9-15-13(19)18-11-8-6-5-7-10(11)16-12(18)17-14(20)21-2/h5-8,15-16H,3-4,9H2,1-2H3
39 atoms
O  -0.525864 -2.52745 0.051397
O  2.398712 2.893587 0.434474
O  0.37346 3.660796 -0.126632
N  -0.855507 -0.279933 0.120873
N  1.205142 -1.214737 0.693546
N  -1.542821 1.775915 -0.200399
N  0.780941 1.414695 0.273915
C  2.849854 -2.524949 -0.616661
C  2.190111 -2.27821 0.73404
C  -2.238269 -0.33988 -0.119675
C  3.852129 -3.673993 -0.593641
C  -2.656178 0.973228 -0.317969
C  -0.453846 1.04172 0.070763
C  -0.036722 -1.434743 0.275752
C  -3.156744 -1.37819 -0.154304
C  -3.972846 1.30838 -0.566733
C  5.033052 -3.449668 0.340888
C  -4.484086 -1.048001 -0.402504
C  -4.889435 0.268157 -0.608442
C  1.104412 2.727517 0.167992
C  2.913363 4.219821 0.362828
H  3.350085 -1.608116 -0.943109
H  2.074699 -2.738891 -1.357179
H  2.931026 -1.986661 1.476866
H  1.720399 -3.190338 1.10255
H  3.338606 -4.599961 -0.3191
H  4.223652 -3.825353 -1.609581
H  1.522887 -0.248909 0.725071
H  -2.875227 -2.405284 0.003793
H  -4.270609 2.336754 -0.717338
H  5.774292 -4.242129 0.231884
H  5.532351 -2.502291 0.127774
H  4.733562 -3.434654 1.389598
H  -5.218369 -1.841201 -0.43475
H  -5.931379 0.484845 -0.79978
H  2.40148 4.892257 1.049584
H  3.957863 4.150307 0.650812
H  2.850943 4.621432 -0.64763
H  -1.501729 2.78118 -0.295082
elementType: O N C H
totalener: -989.19806571 hartree
nucrepener: 1677.57349287 hartree
electener: -2666.77155858 hartree
oneelecener: -4678.00735070 hartree
twoeener: 2011.23579212 hartree
cpcmener: -0.03093646 hartree
kineticenergy: 985.03550195 hartree
xcener: -94.235633318377 hartree
chargesum: 0.0000000
charge: -0.536882 -0.321829 -0.549682 -0.034706 -0.241883 -0.140116 -0.486661 -0.122966 -0.026644 0.110217 -0.108478 0.057888 0.388501 0.419160 -0.202648 -0.170590 -0.280542 -0.160955 -0.146387 0.528490 -0.125116 0.071213 0.081979 0.108487 0.091883 0.061538 0.071313 0.202100 0.160456 0.158632 0.093025 0.082611 0.080659 0.161626 0.162987 0.113194 0.127660 0.116189 0.206274
qa: -0.5369 -0.3218 -0.5497 -0.0347 -0.2419 -0.1401 -0.4867 -0.1230 -0.0266 0.1102 -0.1085 0.0579 0.3885 0.4192 -0.2026 -0.1706 -0.2805 -0.1610 -0.1464 0.5285 -0.1251 0.0712 0.0820 0.1085 0.0919 0.0615 0.0713 0.2021 0.1605 0.1586 0.0930 0.0826 0.0807 0.1616 0.1630 0.1132 0.1277 0.1162 0.2063
va: 1.9671 2.0725 1.9337 3.2935 3.2334 3.4302 2.8570 3.8660 3.8299 3.7738 3.8942 3.8707 4.1060 4.2468 3.9912 3.9411 3.9329 3.9102 3.8887 4.2635 3.8725 1.0159 1.0199 1.0019 1.0166 1.0074 1.0063 1.0535 1.0257 0.9984 1.0038 0.9993 0.9974 0.9910 0.9883 0.9943 0.9957 0.9928 1.0248
dispcorr: -0.015676381 hartree
energy: -989.213742088676
dipole: 22.68050 -22.61178 0.06873 -12.90561 13.93968 1.03407 -0.37185 0.46344 0.09159
magnitude: 1.04039 au
magnitude: 2.64445 debye
