program: Orca
programVersion: 4.2.1
elementType: O O O N N N N C C C C C C C C C C C C C C H H H H H H H H H H H H H H H H H H
charge: 0
multiplicity: 1
keywords: wb97x-d3
keywords: def2-TZVPP
keywords: def2/J RIJCOSX GRIDX6 NOFINALGRIDX
keywords: grid4 nofinalgrid
keywords: scfconv7
keywords: smallprint printgap noloewdin
keywords: NOSOSCF
formula: C14H18N4O3
InChI: InChI=1S/C14H18N4O3/c1-3-4-9-15-13(19)18-11-8-6-5-7-10(11)16-12(18)17-14(20)21-2/h5-8,15-16H,3-4,9H2,1-2H3
39 atoms
O  -0.526427 -2.52792 -0.208659
O  2.405562 2.90949 -0.071365
O  0.313748 3.683032 0.116592
N  -0.847351 -0.278031 -0.195503
N  1.279825 -1.184665 -0.493487
N  -1.58311 1.774629 0.023623
N  0.784295 1.427821 -0.138971
C  3.151063 -2.196125 0.748703
C  2.286694 -2.226798 -0.505036
C  -2.249074 -0.346951 -0.127106
C  4.316174 -3.17858 0.694674
C  -2.696852 0.964167 0.009725
C  -0.463601 1.046942 -0.10201
C  -0.009741 -1.427655 -0.291863
C  -3.159133 -1.391657 -0.187343
C  -4.035635 1.29153 0.099539
C  3.893677 -4.6410 0.662249
C  -4.508687 -1.069575 -0.098707
C  -4.944419 0.244925 0.044319
C  1.084414 2.745676 -0.019585
C  2.898061 4.240609 0.047087
H  2.527548 -2.404373 1.623421
H  3.544036 -1.18385 0.878956
H  1.793363 -3.188931 -0.62251
H  2.912499 -2.084695 -1.388478
H  4.938058 -2.955767 -0.177592
H  4.950541 -3.009321 1.567607
H  1.581801 -0.212557 -0.46127
H  -2.853853 -2.417819 -0.298951
H  -4.354658 2.319242 0.20635
H  3.251969 -4.884963 1.511256
H  3.347386 -4.895252 -0.247135
H  4.761816 -5.299639 0.708086
H  -5.236003 -1.868617 -0.143035
H  -6.003123 0.454507 0.111464
H  2.629159 4.687583 1.004442
H  3.980081 4.165212 -0.015606
H  2.540429 4.878495 -0.761437
H  -1.567524 2.780876 0.110609
elementType: O N C H
totalener: -989.19755253 hartree
nucrepener: 1675.59037125 hartree
electener: -2664.78792378 hartree
oneelecener: -4674.04163306 hartree
twoeener: 2009.25370927 hartree
cpcmener: -0.03070063 hartree
kineticenergy: 985.02756373 hartree
xcener: -94.234978135618 hartree
chargesum: 0.0000000
charge: -0.540848 -0.320705 -0.548558 -0.036770 -0.230284 -0.138862 -0.481490 -0.106410 -0.034340 0.111909 -0.107811 0.054500 0.384717 0.423052 -0.202493 -0.170238 -0.277791 -0.162346 -0.145924 0.527624 -0.125392 0.071720 0.072747 0.087705 0.107776 0.058003 0.071474 0.197161 0.162049 0.158135 0.082581 0.079390 0.092974 0.161329 0.162794 0.114866 0.127604 0.114434 0.205718
qa: -0.5408 -0.3207 -0.5486 -0.0368 -0.2303 -0.1389 -0.4815 -0.1064 -0.0343 0.1119 -0.1078 0.0545 0.3847 0.4231 -0.2025 -0.1702 -0.2778 -0.1623 -0.1459 0.5276 -0.1254 0.0717 0.0727 0.0877 0.1078 0.0580 0.0715 0.1972 0.1620 0.1581 0.0826 0.0794 0.0930 0.1613 0.1628 0.1149 0.1276 0.1144 0.2057
va: 1.9674 2.0731 1.9354 3.2940 3.2407 3.4302 2.8632 3.8860 3.8259 3.7768 3.8978 3.8728 4.1117 4.2421 3.9883 3.9438 3.9312 3.9089 3.8899 4.2625 3.8726 1.0102 1.0211 1.0290 0.9990 1.0090 1.0065 1.0548 1.0261 0.9986 0.9994 0.9992 1.0037 0.9914 0.9885 0.9935 0.9955 0.9936 1.0248
dispcorr: -0.015549645 hartree
energy: -989.213102178957
dipole: 21.39211 -21.24603 0.14608 -14.27648 15.37219 1.09572 3.29110 -3.29523 -0.00413
magnitude: 1.10542 au
magnitude: 2.80975 debye
