program: Orca
programVersion: 4.2.1
elementType: O O O N N N N C C C C C C C C C C C C C C H H H H H H H H H H H H H H H H H H
charge: 0
multiplicity: 1
keywords: wb97x-d3
keywords: def2-TZVPP
keywords: def2/J RIJCOSX GRIDX6 NOFINALGRIDX
keywords: grid4 nofinalgrid
keywords: scfconv7
keywords: smallprint printgap noloewdin
keywords: NOSOSCF
formula: C14H18N4O3
InChI: InChI=1S/C14H18N4O3/c1-3-4-9-15-13(19)18-11-8-6-5-7-10(11)16-12(18)17-14(20)21-2/h5-8,15-16H,3-4,9H2,1-2H3
39 atoms
O  -0.525406 -2.664713 -0.759681
O  2.536369 2.623013 0.068183
O  0.487809 3.383202 0.552203
N  -0.79958 -0.440316 -0.379211
N  1.295466 -1.327092 -0.905885
N  -1.473637 1.557964 0.220142
N  0.867835 1.214624 -0.169831
C  2.76112 -3.104457 0.098701
C  2.239842 -2.400529 -1.150195
C  -2.194982 -0.503806 -0.22625
C  3.819275 -2.348236 0.897456
C  -2.603427 0.772488 0.152681
C  -0.382218 0.848122 -0.100996
C  0.008833 -1.571593 -0.690486
C  -3.130693 -1.513689 -0.393998
C  -3.925686 1.09592 0.386548
C  3.347732 -1.076207 1.588943
C  -4.463687 -1.195092 -0.160673
C  -4.859268 0.082922 0.22483
C  1.217985 2.476895 0.17997
C  3.082222 3.892718 0.411172
H  3.198875 -4.049553 -0.233255
H  1.920695 -3.373119 0.745611
H  1.771718 -3.128494 -1.811929
H  3.071664 -1.969089 -1.708066
H  4.2140 -3.029738 1.655385
H  4.662418 -2.113928 0.240352
H  1.629003 -0.382667 -0.728661
H  -2.858162 -2.511155 -0.693191
H  -4.214528 2.09565 0.680122
H  4.115989 -0.701713 2.266947
H  3.12692 -0.270149 0.889528
H  2.447833 -1.253466 2.181256
H  -5.210353 -1.967331 -0.285533
H  -5.906117 0.291171 0.397995
H  4.154391 3.806779 0.257608
H  2.695717 4.686779 -0.227986
H  2.893114 4.145705 1.454546
H  -1.42495 2.535452 0.472182
elementType: O N C H
totalener: -989.19525575 hartree
nucrepener: 1719.55864276 hartree
electener: -2708.75389851 hartree
oneelecener: -4762.02750698 hartree
twoeener: 2053.27360847 hartree
cpcmener: -0.03026162 hartree
kineticenergy: 985.02796336 hartree
xcener: -94.235155442998 hartree
chargesum: 0.0000000
charge: -0.540521 -0.311646 -0.551097 -0.034611 -0.230447 -0.138447 -0.476475 -0.126166 -0.050992 0.109667 -0.094522 0.059421 0.379596 0.422353 -0.202833 -0.172469 -0.267696 -0.161390 -0.146121 0.530415 -0.125730 0.083396 0.071731 0.100356 0.106565 0.070286 0.053731 0.206344 0.161343 0.157855 0.096172 0.056239 0.080485 0.161337 0.163170 0.126195 0.114239 0.114868 0.205398
qa: -0.5405 -0.3116 -0.5511 -0.0346 -0.2304 -0.1384 -0.4765 -0.1262 -0.0510 0.1097 -0.0945 0.0594 0.3796 0.4224 -0.2028 -0.1725 -0.2677 -0.1614 -0.1461 0.5304 -0.1257 0.0834 0.0717 0.1004 0.1066 0.0703 0.0537 0.2063 0.1613 0.1579 0.0962 0.0562 0.0805 0.1613 0.1632 0.1262 0.1142 0.1149 0.2054
va: 1.9646 2.0835 1.9351 3.2919 3.2268 3.4324 2.8706 3.8594 3.8549 3.7773 3.8926 3.8681 4.1211 4.2467 3.9862 3.9423 3.9434 3.9083 3.8885 4.2502 3.8747 1.0109 1.0191 1.0179 1.0001 1.0044 1.0077 1.0463 1.0263 0.9990 1.0043 1.0110 1.0030 0.9912 0.9883 0.9958 0.9938 0.9932 1.0248
dispcorr: -0.017495738 hartree
energy: -989.212751488380
dipole: 19.19657 -19.04653 0.15004 -7.02287 8.04564 1.02277 5.15993 -4.95595 0.20398
magnitude: 1.05365 au
magnitude: 2.67817 debye
