program: Orca
programVersion: 4.2.1
elementType: O O O N N N N C C C C C C C C C C C C C C H H H H H H H H H H H H H H H H H H
charge: 0
multiplicity: 1
keywords: wb97x-d3
keywords: def2-TZVPP
keywords: def2/J RIJCOSX GRIDX6 NOFINALGRIDX
keywords: grid4 nofinalgrid
keywords: scfconv7
keywords: smallprint printgap noloewdin
keywords: NOSOSCF
formula: C14H18N4O3
InChI: InChI=1S/C14H18N4O3/c1-3-4-9-15-13(19)18-11-8-6-5-7-10(11)16-12(18)17-14(20)21-2/h5-8,15-16H,3-4,9H2,1-2H3
39 atoms
O  -0.51239 -2.497509 0.408147
O  2.380816 2.955863 0.330695
O  0.386446 3.6357 -0.425439
N  -0.849087 -0.255581 0.242146
N  1.211476 -1.11822 0.91708
N  -1.535804 1.752751 -0.304078
N  0.777532 1.455076 0.255576
C  2.900696 -2.531333 -0.227082
C  2.2007 -2.165568 1.074863
C  -2.22739 -0.345701 -0.012803
C  3.955314 -3.610631 -0.023077
C  -2.645316 0.937613 -0.354855
C  -0.450314 1.0558 0.063144
C  -0.027912 -1.385735 0.520435
C  -3.14312 -1.385167 0.047948
C  -3.958389 1.239408 -0.658825
C  4.693681 -3.956208 -1.30719
C  -4.467216 -1.088082 -0.254197
C  -4.872117 0.197149 -0.60477
C  1.102807 2.749666 0.014953
C  2.899967 4.264461 0.11562
H  3.368471 -1.6356 -0.646755
H  2.160242 -2.870747 -0.957502
H  2.930722 -1.807876 1.800854
H  1.727307 -3.043086 1.514638
H  4.673862 -3.278423 0.73209
H  3.482296 -4.510351 0.381182
H  1.523648 -0.151793 0.853107
H  -2.862223 -2.388501 0.319237
H  -4.254705 2.245274 -0.922341
H  5.442427 -4.7313 -1.140058
H  4.008223 -4.320738 -2.074296
H  5.208667 -3.084187 -1.714351
H  -5.198984 -1.883175 -0.212819
H  -5.911378 0.388132 -0.83441
H  2.926629 4.515799 -0.945706
H  2.330183 5.024259 0.652266
H  3.916279 4.248623 0.501289
H  -1.494616 2.741752 -0.507192
elementType: O N C H
totalener: -989.19935715 hartree
nucrepener: 1672.85384216 hartree
electener: -2662.05319932 hartree
oneelecener: -4668.56824329 hartree
twoeener: 2006.51504398 hartree
cpcmener: -0.03101785 hartree
kineticenergy: 985.02603872 hartree
xcener: -94.232900736563 hartree
chargesum: 0.0000000
charge: -0.536905 -0.321556 -0.549060 -0.035721 -0.241411 -0.138926 -0.485977 -0.105558 -0.025088 0.110499 -0.092489 0.057510 0.388468 0.421611 -0.202332 -0.171789 -0.277587 -0.160890 -0.145621 0.528739 -0.124808 0.063817 0.070092 0.105775 0.087776 0.059449 0.061738 0.202696 0.160045 0.158904 0.092451 0.079596 0.079623 0.161482 0.163320 0.117482 0.111746 0.127179 0.205721
qa: -0.5369 -0.3216 -0.5491 -0.0357 -0.2414 -0.1389 -0.4860 -0.1056 -0.0251 0.1105 -0.0925 0.0575 0.3885 0.4216 -0.2023 -0.1718 -0.2776 -0.1609 -0.1456 0.5287 -0.1248 0.0638 0.0701 0.1058 0.0878 0.0594 0.0617 0.2027 0.1600 0.1589 0.0925 0.0796 0.0796 0.1615 0.1633 0.1175 0.1117 0.1272 0.2057
va: 1.9671 2.0725 1.9344 3.2935 3.2296 3.4299 2.8577 3.8526 3.8488 3.7740 3.8820 3.8709 4.1069 4.2452 3.9889 3.9415 3.9430 3.9097 3.8894 4.2618 3.8723 1.0171 1.0173 1.0041 1.0199 1.0075 1.0069 1.0536 1.0258 0.9984 1.0035 1.0006 1.0006 0.9910 0.9882 0.9921 0.9949 0.9956 1.0247
dispcorr: -0.015387956 hartree
energy: -989.214745109360
dipole: 22.16430 -22.10074 0.06356 -13.81597 14.88370 1.06773 -2.87873 2.90634 0.02761
magnitude: 1.06997 au
magnitude: 2.71966 debye
