program: Gaussian 09
title: 000038008
version: EM64L-G09RevD.01
frameworkgroup: C1[X(C13H16N2O)]
method: RPBEPBE
basis: SDD
operation: Freq
keyword: #p
keyword: freq=noraman
keyword: PBEPBE/SDD
title: #p freq=noraman PBEPBE/SDD
converged: YES YES NO NO
title: Mulliken charges:
elementType: O N N C C C C C C C C C C C C C H H H H H H H H H H H H H H H H
charge: -0.274829 -0.257412 -0.314876 0.277631 -0.461515 0.100958 0.196999 -0.368836 0.210346 -0.448306 -0.335114 -0.820954 -0.571642 0.315758 -0.365932 -0.536454 0.213484 0.233624 0.232801 0.203636 0.197139 0.230968 0.274284 0.227207 0.225937 0.231612 0.221641 0.246723 0.243591 0.215778 0.216476 0.239278
chargesum: 0.00000
title: Mulliken charges with hydrogens summed into heavy atoms:
elementType: O N N C C C C C C C C C C C C C
charge: -0.274829 -0.257412 -0.040592 0.277631 -0.014407 0.100958 0.196999 0.067600 0.210346 -0.020199 -0.107906 -0.141765 -0.324919 0.315758 -0.122342 0.135078
polarizability: 2.33114710e+02 -5.41397395e+00 1.65022392e+02 4.01964474e-01 -1.44082894e-01 8.63093429e+01
1716.lowfreq: -8.5965 -4.6867 -0.0003 0.0003 0.0005 5.8314 51.7450 90.7785 98.4806
frequency: 51.7394 90.7457 98.4738 106.4410 142.4884 147.6661 158.2764 212.2808 218.2437 239.7601 262.5731 302.0802 332.3543 364.4822 383.7214 428.2200 433.1196 441.9804 501.9277 530.5253 552.3646 579.7365 604.5920 634.6395 654.6383 697.5460 736.3091 744.7678 793.1788 832.5102 839.5919 875.3855 900.3949 923.3389 960.8041 988.7492 996.7162 1025.4109 1036.1685 1043.1002 1054.7625 1087.5206 1113.5992 1128.1134 1150.8877 1159.9189 1168.6601 1186.4311 1195.1072 1220.4700 1248.6532 1259.5309 1290.2026 1315.0018 1324.4618 1370.6729 1383.1454 1401.4670 1417.0945 1427.8158 1431.8467 1442.5328 1452.4447 1462.7573 1465.6146 1469.0601 1471.2590 1472.5713 1477.1484 1485.0985 1495.0422 1580.4919 1592.8855 1627.9450 2818.5287 2873.6057 2948.0056 2959.3855 2979.6325 3015.9260 3027.3135 3030.2875 3040.3065 3060.4875 3069.6824 3115.6651 3133.4187 3153.5541 3169.0972 3504.6877
redmass: 3.8189 3.2373 1.5299 1.4651 3.7957 3.1310 2.8928 3.0623 1.6391 3.0638 1.8132 2.7848 2.4184 5.1555 5.5399 2.3651 2.0175 3.6640 4.3079 2.8148 4.3631 3.5164 3.8399 3.4983 4.3921 5.3521 3.1644 3.3340 1.5216 2.4860 1.6820 3.4478 2.4813 1.3309 3.2269 2.7244 4.3873 1.8408 1.7292 1.8617 1.7728 1.9052 1.2621 1.2895 1.5626 1.9890 2.9785 1.2542 1.5338 2.6841 1.5727 1.5229 1.6451 1.6323 1.4552 3.4058 1.6863 1.3174 5.3920 2.0490 1.5068 1.3332 1.1710 1.0504 1.8553 1.0873 1.7570 1.1252 1.2906 1.5077 1.2411 7.5134 7.3771 7.5824 1.0716 1.0712 1.0334 1.0377 1.0620 1.0877 1.0978 1.1034 1.0984 1.0910 1.0966 1.0985 1.0890 1.0906 1.0952 1.0761
irintensity: 3.3950 3.0576 1.1357 0.5901 2.0296 1.0871 4.8277 0.2141 3.8541 3.6211 2.1035 3.8471 2.6618 3.2781 0.7757 55.8360 51.5284 8.7169 3.6731 61.0304 2.5425 13.8925 5.6031 16.1055 4.5504 5.3765 8.9354 3.0891 46.7062 7.1702 35.3007 10.0818 17.6393 0.0985 5.1248 5.3605 46.4980 4.9206 7.2975 4.4635 16.8261 14.3585 0.2142 7.2206 20.3476 38.8175 14.9156 5.4908 78.7248 91.3057 42.3486 3.6878 3.2890 49.4242 15.9077 9.0461 53.9677 16.2509 23.1295 25.7384 29.1550 8.3440 3.3037 10.6842 12.1141 20.1899 174.8338 6.1612 6.0416 2.9810 18.3089 2.8950 30.7548 39.1950 124.0569 114.6508 65.1359 63.6891 37.8079 31.8508 24.9866 60.0632 26.9562 54.7543 25.8031 33.9301 13.0426 11.3257 8.9708 0.8197
temp: 298.150 k
press: 1.00000 atm
elementType: 8 7 7 6 6 6 6 6 6 6 6 6 6 6 6 6 1 1 1 1 1 1 1 1 1 1 1 1 1 1 1 1
symmnumber: 1
zpe: 697404.0 jmol-1
zpe.correction: 0.265627 hartree
zpe.thermalcorrener: 0.280283 hartree
zpe.thermalcorrenthalpy: 0.281227 hartree
zpe.thermalcorrgfe: 0.224536 hartree
zpe.sumelectzpe: -688.515585 hartree
zpe.sumelectthermal: -688.500929 hartree
zpe.sumelectthermalent: -688.499985 hartree
zpe.sumelectthermalfe: -688.556676 hartree
dipole: -3.1100 0.6492 0.9596
dipole: 3.3188
quadrupole: -77.9242 -84.3954 -100.6082
quadrupole: 12.0737 -3.2977 -0.5615
quadrupole: 9.7184 3.2472 -12.9656 12.0737 -3.2977 -0.5615
hfenergy: -688.7812118 hartree
pointgroup: C01 [X(C13H16N2O1)]
dipole: -1.2295328 0.2233221 0.3784852 debye
polarizability: 233.3592778|-3.55686|164.7769877|0.2185213|-0.3834847|86.310179 unknown
InChI: InChI=1S/C13H16N2O/c1-9-11-7-10(16-2)3-4-13(11)15-8-14-6-5-12(9)15/h3-4,7,14H,5-6,8H2,1-2H3
charge 0 multiplicity 1
32 atoms
O  4.185633 -0.394263 0.03699
N  -1.400836 -0.609084 -0.067752
N  -3.698067 -1.209595 -0.308583
C  -1.730231 0.762987 -0.045541
C  -3.180549 1.177532 -0.093804
C  -0.552963 1.522192 -0.026826
C  -0.006708 -0.742513 -0.031631
C  -2.373219 -1.700009 0.087045
C  0.551978 0.582267 -0.018326
C  -4.092023 0.028408 0.400472
C  0.808547 -1.895996 -0.009575
C  -0.443905 3.025203 -0.035661
C  1.964369 0.749061 0.000731
C  2.771933 -0.407392 0.016375
C  2.202706 -1.717198 0.013015
C  4.836226 0.912859 0.040464
H  -3.340442 2.085194 0.517628
H  -3.468381 1.423413 -1.135057
H  -2.085055 -2.544857 -0.566129
H  -2.334316 -2.053479 1.151497
H  -3.998694 -0.069733 1.510774
H  -5.146676 0.253735 0.166741
H  -4.410311 -1.946079 -0.311917
H  0.385471 -2.906498 -0.011177
H  0.166072 3.393304 0.812448
H  0.034891 3.396572 -0.963277
H  -1.435791 3.505584 0.035834
H  2.3976 1.753718 0.003689
H  2.884519 -2.572718 0.027582
H  4.558773 1.502294 0.937548
H  4.585083 1.493787 -0.869786
H  5.915966 0.700906 0.057213
